{"text_format":"1","workbook":"xlsx","n_sheets":3,"sheets":["Points & Instructions","Results and table","My Prediction"],"not_rendered":{"charts":0,"images":36,"macros":1,"external_links":0,"defined_names":4,"comments":0,"pivot_tables":0},"unopened":[],"bounds":{"document_bytes":16777216,"sheet_cells":100000,"rows_first":2000,"rows_last":500,"rows_between":2000,"halvings":0,"cell_chars":16384,"cell_head_chars":4096},"cells_cut":0,"cells_raw":0,"read":"whole","date_system":"1900"}

{"sheet":"Points & Instructions","index":0,"n_rows":40,"n_cols":17,"rows_kept":40,"cut":false,"hidden":false,"merged":[]}
[]
[null,"Points calculation",null,null,null,"Instructions",null,null,null,null,null,null,null,null,null,null,"Frequently Asked Questions (FAQ)"]
[null,"All matches"]
[null,"Correct number of goals scored per team","2 points",null,null,"Add participant",null,null,null,null,null,null,null,null,null,null,"1. When I click START to add a tip I get an error message"]
[null,"Correct 1X2 (1X2)","2 points",null,null,null,null,null,null,null,null,null,null,null,null,null,"Answer: Always keep the original \"My Prediction\" sheet and do not rename it. If the sheet is rename or"]
[null,"Total of 6 points for every match for the complete tournament",null,null,null,"Right click on the new sheet, select \"rename\" and type the participants name",null,null,null,null,null,null,null,null,null,null,"removed, the macro/copy does not work properly. The tab must be called \"My tip\""]
[null,null,null,null,null,"You can add as many participants you like"]
[null,"Prediction",null,null,null,null,null,null,null,null,null,null,null,null,null,null,"2. Can I get the password to the file?"]
[null,"Correct team in round of 16","2 points per team",null,null,"Add participant in the table",null,null,null,null,null,null,null,null,null,null,"Answer: No, we do not give out the password. Our contribution is that we publish the tip for free"]
[null,"Correct team in quarterfinal","4 points per team",null,null,"Select sheet \"Results & Table\" and type the participants name in the column \"Name\" in the table"]
{"$rows_left_out":31}
{"sheet":"Results and table","index":1,"n_rows":103,"n_cols":70,"rows_kept":103,"cut":false,"hidden":false,"merged":[[2,54,2,56],[20,3,20,5],[20,6,20,8],[20,51,20,53],[20,54,20,56],[4,18,4,21],[11,3,11,5],[11,6,11,8],[11,51,11,53],[11,54,11,56],[3,18,3,21],[2,3,2,5],[2,6,2,8],[2,18,2,21],[2,51,2,53],[5,18,5,21],[75,13,82,18],[47,6,47,8],[56,6,56,8],[65,6,65,8],[29,3,29,5],[29,6,29,8],[38,6,38,8],[101,3,101,5],[101,6,101,8],[38,3,38,5],[65,3,65,5],[56,3,56,5],[47,3,47,5],[92,3,92,5],[92,6,92,8],[97,3,97,5],[97,6,97,8],[74,3,74,5],[74,6,74,8],[85,3,85,5],[85,6,85,8],[101,54,101,56],[101,51,101,53],[97,54,97,56],[97,51,97,53],[92,54,92,56],[92,51,92,53],[85,54,85,56],[85,51,85,53],[74,54,74,56],[74,51,74,53],[74,34,74,36],[29,51,29,53],[65,54,65,56],[56,54,56,56],[47,54,47,56],[38,54,38,56],[29,54,29,56]]}
[null,null,null,null,null,null,null,null,null,null,{"$f":"count","v":{"$error":"#NAME?"}}]
[null,"Group A",null,null,null,null,null,null,null,null,null,null,null,null,null,null,null,"Bonus questions"]
[null,"Game","Date","Game",null,null,"Result",null,null,"1X2",null,"Group A","Points","GF","GA"," +/-",null,"Category","Answer",null,null,null,null,"Team 1","Points","GF","GA","Lag 2","Points","GF","GA",null,"Rank ties","Rank total","Rank goals","Rank Diff","Rank Points","Team","Points","GF","GA","Diff",null,"Rank","Team","Points","GF","GA","Diff",null,null,null,null,null,null,null,null,null,null,null,null,null,null,null,null,null,"Rank",null,"Name","Points"]
[null,1,"2022-11-20","Qatar","-","Ecuador",null,"-",null,{"$f":"IF(OR(ISBLANK(G4),ISBLANK(I4)),\"\",IF(G4>I4,1,IF(G4<I4,2,\"X\")))","v":""},1,{"$f":"VLOOKUP(K4,$AR$4:$AW$7,2,FALSE)","v":"Qatar"},{"$f":"VLOOKUP(L4,$AS$4:$AW$7,2,FALSE)","v":0},{"$f":"VLOOKUP(L4,$AS$4:$AW$7,3,FALSE)","v":0},{"$f":"VLOOKUP(L4,$AS$4:$AW$7,4,FALSE)","v":0},{"$f":"VLOOKUP(L4,$AS$4:$AW$7,5,FALSE)","v":0},null,"Top scorer",null,null,null,null,null,{"$f":"D4","v":"Qatar"},{"$f":"IF(G4=\"\",0,IF($G4<$I4,0,IF($G4=$I4,1,3)))","v":0},{"$f":"G4","v":0},{"$f":"I4","v":0},{"$f":"F4","v":"Ecuador"},{"$f":"IF(I4=\"\",0,IF(I4<G4,0,IF(I4=G4,1,3)))","v":0},{"$f":"I4","v":0},{"$f":"G4","v":0},null,{"$f":"RANK($AH4,$AH$4:$AH$7,1)+COUNTIF($AH$4:$AH4,$AH4)-1","v":1},{"$f":"AI4+AJ4+AK4","v":1},{"$f":"SUMPRODUCT(($AM$4:$AM$7=AM4)*($AP$4:$AP$7=AP4)*($AN$4:$AN$7>AN4))","v":0},{"$f":"SUMPRODUCT(($AM$4:$AM$7=AM4)*($AP$4:$AP$7>AP4))","v":0},{"$f":"RANK(AM4,$AM$4:$AM$7)","v":1},"Qatar",{"$f":"SUMIF($X$4:$X$9,$AL4,$Y$4:$Y$9)+SUMIF($AB$4:$AB$9,$AL4,$AC$4:$AC$9)","v":0},{"$f":"SUMIF($X$4:$X$9,AL4,$Z$4:$Z$9)+SUMIF($AB$4:$AB$9,AL4,$AD$4:$AD$9)","v":0},{"$f":"SUMIF($AB$4:$AB$9,AL4,$AE$4:$AE$9)+SUMIF($X$4:$X$9,AL4,$AA$4:$AA$9)","v":0},{"$f":"AN4-AO4","v":0},null,1,{"$f":"VLOOKUP($AR4,$AG$4:$AP$7,6,FALSE)","v":"Qatar"},{"$f":"VLOOKUP($AS4,$AL$4:$AP$7,2,FALSE)","v":0},{"$f":"VLOOKUP($AS4,$AL$4:$AP$7,3,FALSE)","v":0},{"$f":"VLOOKUP($AS4,$AL$4:$AP$7,4,FALSE)","v":0},{"$f":"VLOOKUP($AS4,$AL$4:$AP$7,5,FALSE)","v":0},null,null,null,null,null,null,null,null,null,null,null,null,null,null,null,null,null,1,null,"My prediction",{"$f":"'My Prediction'!V20","v":0}]
[null,2,"2022-11-21","Senegal","-","Netherlands",null,"-",null,{"$f":"IF(OR(ISBLANK(G5),ISBLANK(I5)),\"\",IF(G5>I5,1,IF(G5<I5,2,\"X\")))","v":""},2,{"$f":"VLOOKUP(K5,$AR$4:$AW$7,2,FALSE)","v":"Ecuador"},{"$f":"VLOOKUP(L5,$AS$4:$AW$7,2,FALSE)","v":0},{"$f":"VLOOKUP(L5,$AS$4:$AW$7,3,FALSE)","v":0},{"$f":"VLOOKUP(L5,$AS$4:$AW$7,4,FALSE)","v":0},{"$f":"VLOOKUP(L5,$AS$4:$AW$7,5,FALSE)","v":0},null,"World champion",{"$f":"IF(L103=0,\"\",L103)","v":""},null,null,null,null,{"$f":"D5","v":"Senegal"},0,0,0,{"$f":"F5","v":"Netherlands"},0,0,0,null,{"$f":"RANK($AH5,$AH$4:$AH$7,1)+COUNTIF($AH$4:$AH5,$AH5)-1","v":2},{"$f":"AI5+AJ5+AK5","v":1},{"$f":"SUMPRODUCT(($AM$4:$AM$7=AM5)*($AP$4:$AP$7=AP5)*($AN$4:$AN$7>AN5))","v":0},{"$f":"SUMPRODUCT(($AM$4:$AM$7=AM5)*($AP$4:$AP$7>AP5))","v":0},{"$f":"RANK(AM5,$AM$4:$AM$7)","v":1},"Ecuador",{"$f":"SUMIF($X$4:$X$9,$AL5,$Y$4:$Y$9)+SUMIF($AB$4:$AB$9,$AL5,$AC$4:$AC$9)","v":0},{"$f":"SUMIF($X$4:$X$9,AL5,$Z$4:$Z$9)+SUMIF($AB$4:$AB$9,AL5,$AD$4:$AD$9)","v":0},{"$f":"SUMIF($AB$4:$AB$9,AL5,$AE$4:$AE$9)+SUMIF($X$4:$X$9,AL5,$AA$4:$AA$9)","v":0},{"$f":"AN5-AO5","v":0},null,2,{"$f":"VLOOKUP($AR5,$AG$4:$AP$7,6,FALSE)","v":"Ecuador"},{"$f":"VLOOKUP($AS5,$AL$4:$AP$7,2,FALSE)","v":0},{"$f":"VLOOKUP($AS5,$AL$4:$AP$7,3,FALSE)","v":0},{"$f":"VLOOKUP($AS5,$AL$4:$AP$7,4,FALSE)","v":0},{"$f":"VLOOKUP($AS5,$AL$4:$AP$7,5,FALSE)","v":0},null,null,null,null,null,null,null,null,null,null,null,null,null,null,null,null,null,2]
[null,18,"2022-11-25","Qatar","-","Senegal",null,"-",null,"",3,{"$f":"VLOOKUP(K6,$AR$4:$AW$7,2,FALSE)","v":"Senegal"},{"$f":"VLOOKUP(L6,$AS$4:$AW$7,2,FALSE)","v":0},{"$f":"VLOOKUP(L6,$AS$4:$AW$7,3,FALSE)","v":0},{"$f":"VLOOKUP(L6,$AS$4:$AW$7,4,FALSE)","v":0},{"$f":"VLOOKUP(L6,$AS$4:$AW$7,5,FALSE)","v":0},null,"Winner play-off for third place",{"$f":"IF(L99=0,\"\",L99)","v":""},null,null,null,null,"Qatar",0,0,0,"Senegal",0,0,0,null,{"$f":"RANK($AH6,$AH$4:$AH$7,1)+COUNTIF($AH$4:$AH6,$AH6)-1","v":3},1,0,0,1,"Senegal",0,{"$f":"SUMIF($X$4:$X$9,AL6,$Z$4:$Z$9)+SUMIF($AB$4:$AB$9,AL6,$AD$4:$AD$9)","v":0},0,0,null,3,"Senegal",0,0,0,0,null,null,null,null,null,null,null,null,null,null,null,null,null,null,null,null,null,3]
[null,19,"2022-11-25","Netherlands","-","Ecuador",null,"-",null,"",4,{"$f":"VLOOKUP(K7,$AR$4:$AW$7,2,FALSE)","v":"Netherlands"},{"$f":"VLOOKUP(L7,$AS$4:$AW$7,2,FALSE)","v":0},{"$f":"VLOOKUP(L7,$AS$4:$AW$7,3,FALSE)","v":0},{"$f":"VLOOKUP(L7,$AS$4:$AW$7,4,FALSE)","v":0},{"$f":"VLOOKUP(L7,$AS$4:$AW$7,5,FALSE)","v":0},null,null,null,null,null,null,null,"Netherlands",0,0,0,"Ecuador",0,0,0,null,{"$f":"RANK($AH7,$AH$4:$AH$7,1)+COUNTIF($AH$4:$AH7,$AH7)-1","v":4},1,0,0,1,"Netherlands",0,{"$f":"SUMIF($X$4:$X$9,AL7,$Z$4:$Z$9)+SUMIF($AB$4:$AB$9,AL7,$AD$4:$AD$9)","v":0},0,0,null,4,"Netherlands",0,0,0,0,null,null,null,null,null,null,null,null,null,null,null,null,null,null,null,null,null,4]
[null,35,"2022-11-29","Ecuador","-","Senegal",null,"-",null,"",null,{"$f":"COUNTBLANK(G4:G9)+COUNTBLANK(I4:I9)","v":12},null,null,null,null,null,null,null,null,null,null,null,"Ecuador",0,0,0,"Senegal",0,0,0,null,null,null,null,null,null,null,null,null,null,null,null,null,null,null,null,null,null,null,null,null,null,null,null,null,null,null,null,null,null,null,null,null,null,null,5]
[null,36,"2022-11-29","Netherlands","-","Qatar",null,"-",null,"",null,null,null,null,null,null,null,null,null,null,null,null,null,"Netherlands",0,0,0,"Qatar",0,0,0,null,null,null,null,null,null,null,null,null,null,null,null,null,null,null,null,null,null,null,null,null,null,null,null,null,null,null,null,null,null,null,null,null,null,null,6]
[null,null,null,null,null,null,null,null,null,null,null,null,null,null,null,null,null,null,null,null,null,null,null,null,null,null,null,null,null,null,null,null,null,null,null,null,null,null,null,null,null,null,null,null,null,null,null,null,null,null,null,null,null,null,null,null,null,null,null,null,null,null,null,null,null,null,7]
{"$rows_left_out":94}
{"sheet":"My Prediction","index":2,"n_rows":120,"n_cols":68,"rows_kept":120,"cut":false,"hidden":false,"merged":[[11,56,11,58],[2,3,2,5],[2,6,2,8],[2,19,2,22],[2,53,2,55],[2,56,2,58],[3,19,3,22],[4,19,4,22],[5,19,5,22],[11,3,11,5],[11,6,11,8],[11,53,11,55],[20,3,20,5],[20,6,20,8],[20,53,20,55],[20,56,20,58],[29,3,29,5],[29,6,29,8],[29,53,29,55],[29,56,29,58],[38,3,38,5],[38,6,38,8],[38,56,38,58],[47,3,47,5],[47,6,47,8],[47,56,47,58],[56,3,56,5],[56,6,56,8],[56,56,56,58],[65,3,65,5],[65,6,65,8],[65,56,65,58],[97,3,97,5],[97,6,97,8],[97,15,97,18],[74,3,74,5],[74,6,74,8],[74,15,74,18],[75,15,75,18],[85,3,85,5],[85,6,85,8],[85,15,85,18],[86,15,86,18],[92,3,92,5],[92,6,92,8],[92,15,92,18],[93,15,93,18],[98,15,98,18],[101,3,101,5],[101,6,101,8],[101,15,101,18],[102,15,102,18]]}
[]
[null,"Group A",null,null,null,null,null,null,null,null,null,null,null,null,null,null,null,null,"Bonus questions"]
[null,"Game","Date","Game",null,null,"Result",null,null,"1X2","Points",null,"Group A","Points","GF","GA"," +/-",null,"Category","Answer",null,null,null,"Points",null,"Team 1","Points","GF","GA","Team 2","Points","GF","GA",null,"Rank ties","Rank total","Rank goals","Rank Diff","Rank Points","Team","Points","GF","GA","Diff",null,"Rank","Team","Points","GF","GA","Diff"]
[null,1,"2022-11-20","Qatar","-","Ecuador",null,"-",null,{"$f":"IF(OR(ISBLANK(G4),ISBLANK(I4)),\"\",IF(G4>I4,1,IF(G4<I4,2,\"X\")))","v":""},{"$f":"IF(OR(G4=\"\",I4=\"\",'Results and table'!G4=\"\",'Results and table'!I4=\"\"),0,IF(G4='Results and table'!G4,2,0)+IF(I4='Results and table'!I4,2,0)+IF(J4='Results and table'!J4,2,0))","v":0},1,{"$f":"VLOOKUP(L4,AT4:AY7,2,FALSE)","v":"Qatar"},{"$f":"VLOOKUP(M4,$AU$4:$AY$7,2,FALSE)","v":0},{"$f":"VLOOKUP(M4,$AU$4:$AY$7,3,FALSE)","v":0},{"$f":"VLOOKUP(M4,$AU$4:$AY$7,4,FALSE)","v":0},{"$f":"VLOOKUP(M4,$AU$4:$AY$7,5,FALSE)","v":0},null,"Top scorer",null,null,null,null,{"$f":"IF(AND('Results and table'!S4>0,T4='Results and table'!S4),20,0)","v":0},null,{"$f":"D4","v":"Qatar"},{"$f":"IF(G4=\"\",0,IF($G4<$I4,0,IF($G4=$I4,1,3)))","v":0},{"$f":"G4","v":0},{"$f":"I4","v":0},{"$f":"F4","v":"Ecuador"},{"$f":"IF(I4=\"\",0,IF(I4<G4,0,IF(G4=I4,1,3)))","v":0},{"$f":"I4","v":0},{"$f":"G4","v":0},null,{"$f":"RANK($AJ4,$AJ$4:$AJ$7,1)+COUNTIF($AJ$4:$AJ4,$AJ4)-1","v":1},{"$f":"AK4+AL4+AM4","v":1},{"$f":"SUMPRODUCT(($AO$4:$AO$7=AO4)*($AR$4:$AR$7=AR4)*($AP$4:$AP$7>AP4))","v":0},{"$f":"SUMPRODUCT(($AO$4:$AO$7=AO4)*($AR$4:$AR$7>AR4))","v":0},{"$f":"RANK(AO4,$AO$4:$AO$7)","v":1},"Qatar",{"$f":"SUMIF($Z$4:$Z$9,$AN4,$AA$4:$AA$9)+SUMIF($AD$4:$AD$9,$AN4,$AE$4:$AE$9)","v":0},{"$f":"SUMIF($Z$4:$Z$9,AN4,$AB$4:$AB$9)+SUMIF($AD$4:$AD$9,AN4,$AF$4:$AF$9)","v":0},{"$f":"SUMIF($AD$4:$AD$9,AN4,$AG$4:$AG$9)+SUMIF($Z$4:$Z$9,AN4,$AC$4:$AC$9)","v":0},{"$f":"AP4-AQ4","v":0},null,1,{"$f":"VLOOKUP($AT4,$AI$4:$AR$7,6,FALSE)","v":"Qatar"},{"$f":"VLOOKUP($AU4,$AN$4:$AR$7,2,FALSE)","v":0},{"$f":"VLOOKUP($AU4,$AN$4:$AR$7,3,FALSE)","v":0},{"$f":"VLOOKUP($AU4,$AN$4:$AR$7,4,FALSE)","v":0},{"$f":"VLOOKUP($AU4,$AN$4:$AR$7,5,FALSE)","v":0}]
[null,2,"2022-11-21","Senegal","-","Netherlands",null,"-",null,{"$f":"IF(OR(ISBLANK(G5),ISBLANK(I5)),\"\",IF(G5>I5,1,IF(G5<I5,2,\"X\")))","v":""},{"$f":"IF(OR(G5=\"\",I5=\"\",'Results and table'!G5=\"\",'Results and table'!I5=\"\"),0,IF(G5='Results and table'!G5,2,0)+IF(I5='Results and table'!I5,2,0)+IF(J5='Results and table'!J5,2,0))","v":0},2,{"$f":"VLOOKUP(L5,AT4:AY7,2,FALSE)","v":"Ecuador"},{"$f":"VLOOKUP(M5,$AU$4:$AY$7,2,FALSE)","v":0},{"$f":"VLOOKUP(M5,$AU$4:$AY$7,3,FALSE)","v":0},{"$f":"VLOOKUP(M5,$AU$4:$AY$7,4,FALSE)","v":0},{"$f":"VLOOKUP(M5,$AU$4:$AY$7,5,FALSE)","v":0},null,"World champion",null,null,null,null,{"$f":"IF(AND('Results and table'!S5>0,T5='Results and table'!S5,T5<>\"\"),20,0)","v":0},null,{"$f":"D5","v":"Senegal"},{"$f":"IF(G5=\"\",0,IF($G5<$I5,0,IF($G5=$I5,1,3)))","v":0},0,0,{"$f":"F5","v":"Netherlands"},{"$f":"IF(I5=\"\",0,IF(I5<G5,0,IF(G5=I5,1,3)))","v":0},0,0,null,{"$f":"RANK($AJ5,$AJ$4:$AJ$7,1)+COUNTIF($AJ$4:$AJ5,$AJ5)-1","v":2},{"$f":"AK5+AL5+AM5","v":1},{"$f":"SUMPRODUCT(($AO$4:$AO$7=AO5)*($AR$4:$AR$7=AR5)*($AP$4:$AP$7>AP5))","v":0},{"$f":"SUMPRODUCT(($AO$4:$AO$7=AO5)*($AR$4:$AR$7>AR5))","v":0},{"$f":"RANK(AO5,$AO$4:$AO$7)","v":1},"Ecuador",{"$f":"SUMIF($Z$4:$Z$9,$AN5,$AA$4:$AA$9)+SUMIF($AD$4:$AD$9,$AN5,$AE$4:$AE$9)","v":0},{"$f":"SUMIF($Z$4:$Z$9,AN5,$AB$4:$AB$9)+SUMIF($AD$4:$AD$9,AN5,$AF$4:$AF$9)","v":0},{"$f":"SUMIF($AD$4:$AD$9,AN5,$AG$4:$AG$9)+SUMIF($Z$4:$Z$9,AN5,$AC$4:$AC$9)","v":0},{"$f":"AP5-AQ5","v":0},null,2,{"$f":"VLOOKUP($AT5,$AI$4:$AR$7,6,FALSE)","v":"Ecuador"},{"$f":"VLOOKUP($AU5,$AN$4:$AR$7,2,FALSE)","v":0},0,{"$f":"VLOOKUP($AU5,$AN$4:$AR$7,4,FALSE)","v":0},{"$f":"VLOOKUP($AU5,$AN$4:$AR$7,5,FALSE)","v":0}]
[null,18,"2022-11-25","Qatar","-","Senegal",null,"-",null,"",{"$f":"IF(OR(G6=\"\",I6=\"\",'Results and table'!G6=\"\",'Results and table'!I6=\"\"),0,IF(G6='Results and table'!G6,2,0)+IF(I6='Results and table'!I6,2,0)+IF(J6='Results and table'!J6,2,0))","v":0},3,{"$f":"VLOOKUP(L6,AT4:AY7,2,FALSE)","v":"Senegal"},{"$f":"VLOOKUP(M6,$AU$4:$AY$7,2,FALSE)","v":0},{"$f":"VLOOKUP(M6,$AU$4:$AY$7,3,FALSE)","v":0},{"$f":"VLOOKUP(M6,$AU$4:$AY$7,4,FALSE)","v":0},{"$f":"VLOOKUP(M6,$AU$4:$AY$7,5,FALSE)","v":0},null,"Winner play-off for third place",null,null,null,null,{"$f":"IF(AND('Results and table'!S6>0,T6='Results and table'!S6,T6<>\"\"),10,0)","v":0},null,"Qatar",0,0,0,"Senegal",0,0,0,null,{"$f":"RANK($AJ6,$AJ$4:$AJ$7,1)+COUNTIF($AJ$4:$AJ6,$AJ6)-1","v":3},1,0,0,1,"Senegal",0,{"$f":"SUMIF($Z$4:$Z$9,AN6,$AB$4:$AB$9)+SUMIF($AD$4:$AD$9,AN6,$AF$4:$AF$9)","v":0},0,0,null,3,"Senegal",0,0,0,0]
[null,19,"2022-11-25","Netherlands","-","Ecuador",null,"-",null,"",{"$f":"IF(OR(G7=\"\",I7=\"\",'Results and table'!G7=\"\",'Results and table'!I7=\"\"),0,IF(G7='Results and table'!G7,2,0)+IF(I7='Results and table'!I7,2,0)+IF(J7='Results and table'!J7,2,0))","v":0},4,{"$f":"VLOOKUP(L7,AT4:AY7,2,FALSE)","v":"Netherlands"},{"$f":"VLOOKUP(M7,$AU$4:$AY$7,2,FALSE)","v":0},{"$f":"VLOOKUP(M7,$AU$4:$AY$7,3,FALSE)","v":0},{"$f":"VLOOKUP(M7,$AU$4:$AY$7,4,FALSE)","v":0},{"$f":"VLOOKUP(M7,$AU$4:$AY$7,5,FALSE)","v":0},null,null,null,null,null,null,null,null,"Netherlands",0,0,0,"Ecuador",0,0,0,null,{"$f":"RANK($AJ7,$AJ$4:$AJ$7,1)+COUNTIF($AJ$4:$AJ7,$AJ7)-1","v":4},1,0,0,1,"Netherlands",0,{"$f":"SUMIF($Z$4:$Z$9,AN7,$AB$4:$AB$9)+SUMIF($AD$4:$AD$9,AN7,$AF$4:$AF$9)","v":0},0,0,null,4,"Netherlands",0,0,0,0]
[null,35,"2022-11-29","Ecuador","-","Senegal",null,"-",null,"",{"$f":"IF(OR(G8=\"\",I8=\"\",'Results and table'!G8=\"\",'Results and table'!I8=\"\"),0,IF(G8='Results and table'!G8,2,0)+IF(I8='Results and table'!I8,2,0)+IF(J8='Results and table'!J8,2,0))","v":0},null,{"$f":"COUNTBLANK(G4:G9)+COUNTBLANK(I4:I9)","v":12},null,null,null,null,null,null,null,null,null,null,null,null,"Ecuador",0,0,0,"Senegal",0,0,0]
[null,36,"2022-11-29","Netherlands","-","Qatar",null,"-",null,"",{"$f":"IF(OR(G9=\"\",I9=\"\",'Results and table'!G9=\"\",'Results and table'!I9=\"\"),0,IF(G9='Results and table'!G9,2,0)+IF(I9='Results and table'!I9,2,0)+IF(J9='Results and table'!J9,2,0))","v":0},null,null,null,null,null,null,null,null,null,null,null,null,null,null,"Netherlands",0,0,0,"Qatar",0,0,0]
[]
{"$rows_left_out":110}