{"text_format":"1","workbook":"xlsx","n_sheets":3,"sheets":["Poäng & instruktioner","Resultat & tabell","Mitt tips"],"not_rendered":{"charts":0,"images":46,"macros":1,"external_links":0,"defined_names":4,"comments":0,"pivot_tables":0},"unopened":[],"bounds":{"document_bytes":16777216,"sheet_cells":100000,"rows_first":2000,"rows_last":500,"rows_between":2000,"halvings":0,"cell_chars":16384,"cell_head_chars":4096},"cells_cut":0,"cells_raw":0,"read":"whole","date_system":"1900"}

{"sheet":"Poäng & instruktioner","index":0,"n_rows":33,"n_cols":6,"rows_kept":33,"cut":false,"hidden":false,"merged":[]}
[]
[null,"Poängräkning",null,null,null,"Instruktioner"]
[null,"Samtliga matcher"]
[null,"Rätt antal mål per lag","2 poäng",null,null,"Addera tips"]
[null,"Rätt tecken (1X2)","3 poäng"]
[null,"7 poäng kan delas ut i samtliga matcher",null,null,null,"Högerklicka på den nya fliken, välj \"rename\"och skriv in tipparens namn"]
[null,null,null,null,null,"Du kan addera så många spelare du önskar"]
[null,"Prediction"]
[null,"Rätt lag i åttondelsfinal","2 poäng per lag",null,null,"Addera tippare i tabellen"]
[null,"Rätt lag i kvartsfinal","4 poäng per lag",null,null,"Välj fliken \"Resultat & tabell\" och skriv in tipparens namn i kolumnen \"Namn\" i tabellen"]
[null,"Rätt lag i semifinal","6 poäng per lag",null,null,"Tryck sedan i motsvarande cell i kolumn \"Poäng\" (exempelvis cell BR5) och skriv ="]
[null,"Rätt lag i bronsmatch","8 poäng per lag",null,null,"Välj den flik med spelarens namn, klicka en gång i cell V20 och tryck Enter"]
[null,"Rätt lag i final","8 poäng per lag",null,null,"Siffran 0 dyker nu upp i cellen bredvid spelarens namn"]
[]
[null,"Bonusfrågor",null,null,null,"Rättning"]
[null,"Skyttekung","20 poäng",null,null,"Fyll i de gula cellerna så uppdateras respektive spelares flik med poäng"]
[null,"Världsmästare","20 poäng",null,null,"Sortera sedan tabellen i fallande ordning i cellen \"Poäng\" under \"Resultat & tabell\" och voila!"]
[null,"Vinnare bronsmatch","10 poäng"]
[null,null,null,null,null,"Bonuspoäng"]
[null,"Totalpoäng",null,null,null,"Bonuspoäng delas ut när alla gruppsspelsmatcher är spelade. Samma gäller åttondelsfinal, kvartsfinal etc. "]
[null,"Gruppspel","336 poäng"]
[null,"Åttondelsfinal","88 poäng","(56+32)",null,"Det finstilta"]
[null,"Kvartsfinaler","60 poäng","(28+32)",null,"Du måste fylla i varje deltagares tips under en separat flik i denna filen. "]
[null,"Semifinal","38 poäng","(14+24)",null,"Detta eftersom det finns formler kopplade i alla flikar, vilka styrs från \"Resultat & tabell\". "]
[null,"Bronsmatch","23 poäng","(7+16)",null,"Tyvärr lite manuellt arbete, men det går relativt snabbt och behövs enbart göras i"]
[null,"Final","23 poäng","(7+16)",null,"innan tipstävlingen drar igång"]
[null,"Bonusfrågor","50 poäng","(20+20+10)"]
[null,"Totalt","618 poäng",null,null,"Bra att veta!"]
[null,null,null,null,null,"I åttondelsfinalerna och framåt  är det möjligt att tippa ett annat lag vidare än vad resultatet visar. "]
[null,null,null,null,null,"Tex om Sverige möter Brasilien och du tippar resultatet 1-2 kan du ändå ange Sverige som vinnare. "]
[null,null,null,null,null,"Gör du så visas \"EJ OK\" vid den matchen som indikerar att resultat och vinnare inte stämmer. "]
[null,null,null,null,null,"Det är helt upp till Dig som tipsgeneral att välja om Du vill godkänna detta eller inte. "]
[null,null,null,null,null,"Tänk även på att bestämma i förväg om slutresultatet är efter 90 minuter, ev förlängning eller straffar "]

{"sheet":"Resultat & tabell","index":1,"n_rows":120,"n_cols":70,"rows_kept":120,"cut":false,"hidden":false,"merged":[[101,3,101,5],[101,6,101,8],[101,51,101,53],[101,54,101,56],[38,3,38,5],[65,3,65,5],[56,3,56,5],[47,3,47,5],[92,3,92,5],[92,6,92,8],[92,51,92,53],[92,54,92,56],[97,3,97,5],[97,6,97,8],[97,51,97,53],[97,54,97,56],[74,3,74,5],[74,6,74,8],[74,51,74,53],[74,54,74,56],[85,3,85,5],[85,6,85,8],[85,51,85,53],[85,54,85,56],[47,6,47,8],[47,54,47,56],[56,6,56,8],[56,54,56,56],[65,6,65,8],[65,54,65,56],[29,3,29,5],[29,6,29,8],[29,51,29,53],[29,54,29,56],[38,6,38,8],[38,54,38,56],[2,54,2,56],[20,3,20,5],[20,6,20,8],[20,51,20,53],[20,54,20,56],[4,18,4,21],[11,3,11,5],[11,6,11,8],[11,51,11,53],[11,54,11,56],[3,18,3,21],[2,3,2,5],[2,6,2,8],[2,18,2,21],[2,51,2,53],[5,18,5,21]]}
[null,null,null,null,null,null,null,null,null,null,{"$f":"count","v":{"$error":"#NAME?"}}]
[null,"Grupp A",null,null,null,null,null,null,null,null,null,null,null,null,null,null,null,"Bonusfrågor",null,null,null,null,null,null,null,null,null,null,null,null,null,null,null,null,null,null,null,null,null,null,null,null,null,null,null,null,null,null,null,"Grupp A",null,null,null,null,null,null,null,null,null,null,"Bonusfrågor"]
[null,"Match","Datum","Match",null,null,"Resultat",null,null,"Tecken",null,"Grupp A","Poäng","GM","IM"," +/-",null,"Kategori","Land eller spelare",null,null,null,null,"Lag 1","Poäng","GM","IM","Lag 2","Poäng","GM","IM",null,"Rank ties","Rank total","Rank mål","Rank Diff","Rank Poäng","Lag","Poäng","GM","IM","Diff",null,"Rank","Lag","Poäng","GM","IM","Diff","Match","Datum","Match",null,null,"Resultat",null,null,"Tecken","Poäng",null,"Kategori","Antal eller spelare","Poäng",null,null,null,"Placering",null,"Namn","Poäng"]
[null,1,"2018-06-14","Ryssland","-","Saudiarabien",null,"-",null,{"$f":"IF(OR(ISBLANK(G4),ISBLANK(I4)),\"\",IF(G4>I4,1,IF(G4<I4,2,\"X\")))","v":""},1,{"$f":"VLOOKUP(K4,$AR$4:$AW$7,2,FALSE)","v":"Ryssland"},{"$f":"VLOOKUP(L4,$AS$4:$AW$7,2,FALSE)","v":0},{"$f":"VLOOKUP(L4,$AS$4:$AW$7,3,FALSE)","v":0},{"$f":"VLOOKUP(L4,$AS$4:$AW$7,4,FALSE)","v":0},{"$f":"VLOOKUP(L4,$AS$4:$AW$7,5,FALSE)","v":0},null,"Skyttekung",null,null,null,null,null,{"$f":"D4","v":"Ryssland"},{"$f":"IF(G4=\"\",0,IF($G4<$I4,0,IF($G4=$I4,1,3)))","v":0},{"$f":"G4","v":0},{"$f":"I4","v":0},{"$f":"F4","v":"Saudiarabien"},{"$f":"IF(I4=\"\",0,IF(I4<G4,0,IF(I4=G4,1,3)))","v":0},{"$f":"I4","v":0},{"$f":"G4","v":0},null,{"$f":"RANK($AH4,$AH$4:$AH$7,1)+COUNTIF($AH$4:$AH4,$AH4)-1","v":1},{"$f":"AI4+AJ4+AK4","v":1},{"$f":"SUMPRODUCT(($AM$4:$AM$7=AM4)*($AP$4:$AP$7=AP4)*($AN$4:$AN$7>AN4))","v":0},{"$f":"SUMPRODUCT(($AM$4:$AM$7=AM4)*($AP$4:$AP$7>AP4))","v":0},{"$f":"RANK(AM4,$AM$4:$AM$7)","v":1},"Ryssland",{"$f":"SUMIF($X$4:$X$9,$AL4,$Y$4:$Y$9)+SUMIF($AB$4:$AB$9,$AL4,$AC$4:$AC$9)","v":0},{"$f":"SUMIF($X$4:$X$9,AL4,$Z$4:$Z$9)+SUMIF($AB$4:$AB$9,AL4,$AD$4:$AD$9)","v":0},{"$f":"SUMIF($AB$4:$AB$9,AL4,$AE$4:$AE$9)+SUMIF($X$4:$X$9,AL4,$AA$4:$AA$9)","v":0},{"$f":"AN4-AO4","v":0},null,1,{"$f":"VLOOKUP($AR4,$AG$4:$AP$7,6,FALSE)","v":"Ryssland"},{"$f":"VLOOKUP($AS4,$AL$4:$AP$7,2,FALSE)","v":0},{"$f":"VLOOKUP($AS4,$AL$4:$AP$7,3,FALSE)","v":0},{"$f":"VLOOKUP($AS4,$AL$4:$AP$7,4,FALSE)","v":0},{"$f":"VLOOKUP($AS4,$AL$4:$AP$7,5,FALSE)","v":0},1,"2014-06-13","Brasilien","-","Kroatien",{"$f":"IF(G4=#REF!,2,0)","v":{"$error":"#REF!"}},"-",{"$f":"IF(I4=#REF!,2,0)","v":{"$error":"#REF!"}},{"$f":"IF(J4=#REF!,2,0)","v":{"$error":"#REF!"}},{"$f":"SUM(BC4+BE4+BF4)","v":{"$error":"#REF!"}},null,"Hur många mål görs i turneringen?",null,{"$f":"IF(#REF!=#REF!,30,0)","v":{"$error":"#REF!"}},null,null,null,1,null,"Mitt tips",{"$f":"'Mitt tips'!V20","v":0}]
[null,2,"2018-06-15","Egypten","-","Uruguay",null,"-",null,{"$f":"IF(OR(ISBLANK(G5),ISBLANK(I5)),\"\",IF(G5>I5,1,IF(G5<I5,2,\"X\")))","v":""},2,{"$f":"VLOOKUP(K5,$AR$4:$AW$7,2,FALSE)","v":"Saudiarabien"},{"$f":"VLOOKUP(L5,$AS$4:$AW$7,2,FALSE)","v":0},{"$f":"VLOOKUP(L5,$AS$4:$AW$7,3,FALSE)","v":0},{"$f":"VLOOKUP(L5,$AS$4:$AW$7,4,FALSE)","v":0},{"$f":"VLOOKUP(L5,$AS$4:$AW$7,5,FALSE)","v":0},null,"Världsmästare",null,null,null,null,null,{"$f":"D5","v":"Egypten"},0,0,0,{"$f":"F5","v":"Uruguay"},0,0,0,null,{"$f":"RANK($AH5,$AH$4:$AH$7,1)+COUNTIF($AH$4:$AH5,$AH5)-1","v":2},{"$f":"AI5+AJ5+AK5","v":1},{"$f":"SUMPRODUCT(($AM$4:$AM$7=AM5)*($AP$4:$AP$7=AP5)*($AN$4:$AN$7>AN5))","v":0},{"$f":"SUMPRODUCT(($AM$4:$AM$7=AM5)*($AP$4:$AP$7>AP5))","v":0},{"$f":"RANK(AM5,$AM$4:$AM$7)","v":1},"Saudiarabien",{"$f":"SUMIF($X$4:$X$9,$AL5,$Y$4:$Y$9)+SUMIF($AB$4:$AB$9,$AL5,$AC$4:$AC$9)","v":0},{"$f":"SUMIF($X$4:$X$9,AL5,$Z$4:$Z$9)+SUMIF($AB$4:$AB$9,AL5,$AD$4:$AD$9)","v":0},{"$f":"SUMIF($AB$4:$AB$9,AL5,$AE$4:$AE$9)+SUMIF($X$4:$X$9,AL5,$AA$4:$AA$9)","v":0},{"$f":"AN5-AO5","v":0},null,2,{"$f":"VLOOKUP($AR5,$AG$4:$AP$7,6,FALSE)","v":"Saudiarabien"},{"$f":"VLOOKUP($AS5,$AL$4:$AP$7,2,FALSE)","v":0},{"$f":"VLOOKUP($AS5,$AL$4:$AP$7,3,FALSE)","v":0},{"$f":"VLOOKUP($AS5,$AL$4:$AP$7,4,FALSE)","v":0},{"$f":"VLOOKUP($AS5,$AL$4:$AP$7,5,FALSE)","v":0},2,"2014-06-13T13:00:00","Mexiko","-","Kamerun",{"$f":"IF(G5=#REF!,2,0)","v":{"$error":"#REF!"}},"-",{"$f":"IF(I5=#REF!,2,0)","v":{"$error":"#REF!"}},{"$f":"IF(J5=#REF!,2,0)","v":{"$error":"#REF!"}},{"$f":"SUM(BC5+BE5+BF5)","v":{"$error":"#REF!"}},null,"Skyttekung",null,{"$f":"IF(S4=#REF!,30,0)","v":{"$error":"#REF!"}},null,null,null,2]
[null,17,"2018-06-19","Ryssland","-","Egypten",null,"-",null,"",3,{"$f":"VLOOKUP(K6,$AR$4:$AW$7,2,FALSE)","v":"Egypten"},{"$f":"VLOOKUP(L6,$AS$4:$AW$7,2,FALSE)","v":0},{"$f":"VLOOKUP(L6,$AS$4:$AW$7,3,FALSE)","v":0},{"$f":"VLOOKUP(L6,$AS$4:$AW$7,4,FALSE)","v":0},{"$f":"VLOOKUP(L6,$AS$4:$AW$7,5,FALSE)","v":0},null,"Vinnare bronsmatch",null,null,null,null,null,"Ryssland",0,0,0,"Egypten",0,0,0,null,{"$f":"RANK($AH6,$AH$4:$AH$7,1)+COUNTIF($AH$4:$AH6,$AH6)-1","v":3},1,0,0,1,"Egypten",0,{"$f":"SUMIF($X$4:$X$9,AL6,$Z$4:$Z$9)+SUMIF($AB$4:$AB$9,AL6,$AD$4:$AD$9)","v":0},0,0,null,3,"Egypten",0,0,0,0,17,"2014-06-17T16:00:00","Brasilien","-","Mexiko",{"$f":"IF(G6=#REF!,2,0)","v":{"$error":"#REF!"}},"-",{"$f":"IF(I6=#REF!,2,0)","v":{"$error":"#REF!"}},{"$f":"IF(J6=#REF!,2,0)","v":{"$error":"#REF!"}},{"$error":"#REF!"},null,null,null,null,null,null,null,3]
[null,18,"2018-06-20","Uruguay","-","Saudiarabien",null,"-",null,"",4,{"$f":"VLOOKUP(K7,$AR$4:$AW$7,2,FALSE)","v":"Uruguay"},{"$f":"VLOOKUP(L7,$AS$4:$AW$7,2,FALSE)","v":0},{"$f":"VLOOKUP(L7,$AS$4:$AW$7,3,FALSE)","v":0},{"$f":"VLOOKUP(L7,$AS$4:$AW$7,4,FALSE)","v":0},{"$f":"VLOOKUP(L7,$AS$4:$AW$7,5,FALSE)","v":0},null,null,null,null,null,null,null,"Uruguay",0,0,0,"Saudiarabien",0,0,0,null,{"$f":"RANK($AH7,$AH$4:$AH$7,1)+COUNTIF($AH$4:$AH7,$AH7)-1","v":4},1,0,0,1,"Uruguay",0,{"$f":"SUMIF($X$4:$X$9,AL7,$Z$4:$Z$9)+SUMIF($AB$4:$AB$9,AL7,$AD$4:$AD$9)","v":0},0,0,null,4,"Uruguay",0,0,0,0,18,"2014-06-18T18:00:00","Kamerun","-","Kroatien",{"$f":"IF(G7=#REF!,2,0)","v":{"$error":"#REF!"}},"-",{"$f":"IF(I7=#REF!,2,0)","v":{"$error":"#REF!"}},{"$f":"IF(J7=#REF!,2,0)","v":{"$error":"#REF!"}},{"$error":"#REF!"},null,null,null,null,null,null,null,4]
[null,33,"2018-06-25","Uruguay","-","Ryssland",null,"-",null,"",null,null,null,null,null,null,null,null,null,null,null,null,null,"Uruguay",0,0,0,"Ryssland",0,0,0,null,null,null,null,null,null,null,null,null,null,null,null,null,null,null,null,null,null,33,"2014-06-23T17:00:00","Kamerun","-","Brasilien",{"$f":"IF(G8=#REF!,2,0)","v":{"$error":"#REF!"}},"-",{"$f":"IF(I8=#REF!,2,0)","v":{"$error":"#REF!"}},{"$f":"IF(J8=#REF!,2,0)","v":{"$error":"#REF!"}},{"$error":"#REF!"},null,null,null,null,null,null,null,5]
[null,34,"2018-06-25","Saudiarabien","-","Egypten",null,"-",null,"",null,null,null,null,null,null,null,null,null,null,null,null,null,"Saudiarabien",0,0,0,"Egypten",0,0,0,null,null,null,null,null,null,null,null,null,null,null,null,null,null,null,null,null,null,34,"2014-06-23T17:00:00","Kroatien","-","Mexiko",{"$f":"IF(G9=#REF!,2,0)","v":{"$error":"#REF!"}},"-",{"$f":"IF(I9=#REF!,2,0)","v":{"$error":"#REF!"}},{"$f":"IF(J9=#REF!,2,0)","v":{"$error":"#REF!"}},{"$error":"#REF!"},null,null,null,null,null,null,null,6]
[null,null,null,null,null,null,null,null,null,null,null,null,null,null,null,null,null,null,null,null,null,null,null,null,null,null,null,null,null,null,null,null,null,null,null,null,null,null,null,null,null,null,null,null,null,null,null,null,null,null,null,null,null,null,null,null,null,null,null,null,null,null,null,null,null,null,7]
[null,"Grupp B",null,null,null,null,null,null,null,null,null,null,null,null,null,null,null,null,null,null,null,null,null,null,null,null,null,null,null,null,null,null,null,null,null,null,null,null,null,null,null,null,null,null,null,null,null,null,null,"Grupp B",null,null,null,null,null,null,null,null,null,null,null,null,null,null,null,null,8]
[null,"Match","Datum","Match",null,null,"Resultat",null,null,"Tecken",null,"Grupp B","Poäng","GM","IM"," +/-",null,null,null,null,null,null,null,"Lag 1","Poäng","GM","IM","Lag 2","Poäng","GM","IM",null,"Rank ties","Rank total","Rank mål","Rank Diff","Rank Poäng","Lag","Poäng","GM","IM","Diff",null,"Rank","Lag","Poäng","GM","IM","Diff","Match","Datum","Match",null,null,"Resultat",null,null,"Tecken","Poäng",null,null,null,null,null,null,null,9]
[null,4,"2018-06-15","Marocko","-","Iran",null,"-",null,{"$f":"IF(OR(ISBLANK(G13),ISBLANK(I13)),\"\",IF(G13>I13,1,IF(G13<I13,2,\"X\")))","v":""},1,{"$f":"VLOOKUP(K13,$AR$13:$AW$16,2,FALSE)","v":"Portugal"},{"$f":"VLOOKUP(L13,$AS$13:$AW$16,2,FALSE)","v":0},{"$f":"VLOOKUP(L13,$AS$13:$AW$16,3,FALSE)","v":0},{"$f":"VLOOKUP(L13,$AS$13:$AW$16,4,FALSE)","v":0},{"$f":"VLOOKUP(L13,$AS$13:$AW$16,5,FALSE)","v":0},null,null,null,null,null,null,null,{"$f":"D13","v":"Marocko"},{"$f":"IF(G13=\"\",0,IF($G13<$I13,0,IF($G13=$I13,1,3)))","v":0},{"$f":"G13","v":0},{"$f":"I13","v":0},{"$f":"F13","v":"Iran"},{"$f":"IF(I13=\"\",0,IF(I13<G13,0,IF(I13=G13,1,3)))","v":0},{"$f":"I13","v":0},{"$f":"G13","v":0},null,{"$f":"RANK($AH13,$AH$13:$AH$16,1)+COUNTIF($AH$13:$AH13,$AH13)-1","v":1},{"$f":"AI13+AJ13+AK13","v":1},{"$f":"SUMPRODUCT(($AM$13:$AM$16=AM13)*($AP$13:$AP$16=AP13)*($AN$13:$AN$16>AN13))","v":0},{"$f":"SUMPRODUCT(($AM$13:$AM$16=AM13)*($AP$13:$AP$16>AP13))","v":0},{"$f":"RANK(AM13,$AM$13:$AM$16)","v":1},"Portugal",{"$f":"SUMIF($X$13:$X$18,$AL13,$Y$13:$Y$18)+SUMIF($AB$13:$AB$18,$AL13,$AC$13:$AC$18)","v":0},{"$f":"SUMIF($X$13:$X$18,$AL13,$Z$13:$Z$18)+SUMIF($AB$13:$AB$18,$AL13,$AD$13:$AD$18)","v":0},{"$f":"SUMIF($X$13:$X$18,$AL13,$AA$13:$AA$18)+SUMIF($AB$13:$AB$18,$AL13,$AE$13:$AE$18)","v":0},{"$f":"AN13-AO13","v":0},null,1,{"$f":"VLOOKUP($AR13,$AG$13:$AP$16,6,FALSE)","v":"Portugal"},{"$f":"VLOOKUP($AS13,$AL$13:$AP$16,2,FALSE)","v":0},{"$f":"VLOOKUP($AS13,$AL$13:$AP$16,3,FALSE)","v":0},{"$f":"VLOOKUP($AS13,$AL$13:$AP$16,4,FALSE)","v":0},{"$f":"VLOOKUP($AS13,$AL$13:$AP$16,5,FALSE)","v":0},3,"2014-06-13T16:00:00","Spanien","-","Holland",{"$f":"IF(G13=#REF!,2,0)","v":{"$error":"#REF!"}},"-",{"$f":"IF(I13=#REF!,2,0)","v":{"$error":"#REF!"}},{"$f":"IF(J13=#REF!,2,0)","v":{"$error":"#REF!"}},{"$f":"SUM(BC13+BE13+BF13)","v":{"$error":"#REF!"}},null,null,null,null,null,null,null,10]
[null,3,"2018-06-15","Portugal","-","Spanien",null,"-",null,{"$f":"IF(OR(ISBLANK(G14),ISBLANK(I14)),\"\",IF(G14>I14,1,IF(G14<I14,2,\"X\")))","v":""},2,{"$f":"VLOOKUP(K14,$AR$13:$AW$16,2,FALSE)","v":"Spanien"},{"$f":"VLOOKUP(L14,$AS$13:$AW$16,2,FALSE)","v":0},{"$f":"VLOOKUP(L14,$AS$13:$AW$16,3,FALSE)","v":0},{"$f":"VLOOKUP(L14,$AS$13:$AW$16,4,FALSE)","v":0},{"$f":"VLOOKUP(L14,$AS$13:$AW$16,5,FALSE)","v":0},null,null,null,null,null,null,null,{"$f":"D14","v":"Portugal"},0,0,0,{"$f":"F14","v":"Spanien"},0,0,0,null,{"$f":"RANK($AH14,$AH$13:$AH$16,1)+COUNTIF($AH$13:$AH14,$AH14)-1","v":2},{"$f":"AI14+AJ14+AK14","v":1},{"$f":"SUMPRODUCT(($AM$13:$AM$16=AM14)*($AP$13:$AP$16=AP14)*($AN$13:$AN$16>AN14))","v":0},{"$f":"SUMPRODUCT(($AM$13:$AM$16=AM14)*($AP$13:$AP$16>AP14))","v":0},{"$f":"RANK(AM14,$AM$13:$AM$16)","v":1},"Spanien",{"$f":"SUMIF($X$13:$X$18,$AL14,$Y$13:$Y$18)+SUMIF($AB$13:$AB$18,$AL14,$AC$13:$AC$18)","v":0},{"$f":"SUMIF($X$13:$X$18,$AL14,$Z$13:$Z$18)+SUMIF($AB$13:$AB$18,AL14,$AD$13:$AD$18)","v":0},{"$f":"SUMIF($X$13:$X$18,$AL14,$AA$13:$AA$18)+SUMIF($AB$13:$AB$18,$AL14,$AE$13:$AE$18)","v":0},{"$f":"AN14-AO14","v":0},null,2,{"$f":"VLOOKUP($AR14,$AG$13:$AP$16,6,FALSE)","v":"Spanien"},{"$f":"VLOOKUP($AS14,$AL$13:$AP$16,2,FALSE)","v":0},{"$f":"VLOOKUP($AS14,$AL$13:$AP$16,3,FALSE)","v":0},{"$f":"VLOOKUP($AS14,$AL$13:$AP$16,4,FALSE)","v":0},{"$f":"VLOOKUP($AS14,$AL$13:$AP$16,5,FALSE)","v":0},4,"2014-06-13T18:00:00","Chile","-","Australien",{"$f":"IF(G14=#REF!,2,0)","v":{"$error":"#REF!"}},"-",{"$f":"IF(I14=#REF!,2,0)","v":{"$error":"#REF!"}},{"$f":"IF(J14=#REF!,2,0)","v":{"$error":"#REF!"}},{"$error":"#REF!"},null,null,null,null,null,null,null,11]
[null,19,"2018-06-20","Portugal","-","Marocko",null,"-",null,"",3,{"$f":"VLOOKUP(K15,$AR$13:$AW$16,2,FALSE)","v":"Marocko"},{"$f":"VLOOKUP(L15,$AS$13:$AW$16,2,FALSE)","v":0},{"$f":"VLOOKUP(L15,$AS$13:$AW$16,3,FALSE)","v":0},{"$f":"VLOOKUP(L15,$AS$13:$AW$16,4,FALSE)","v":0},{"$f":"VLOOKUP(L15,$AS$13:$AW$16,5,FALSE)","v":0},null,null,null,null,null,null,null,"Portugal",0,0,0,"Marocko",0,0,0,null,{"$f":"RANK($AH15,$AH$13:$AH$16,1)+COUNTIF($AH$13:$AH15,$AH15)-1","v":3},{"$f":"AI15+AJ15+AK15","v":1},{"$f":"SUMPRODUCT(($AM$13:$AM$16=AM15)*($AP$13:$AP$16=AP15)*($AN$13:$AN$16>AN15))","v":0},{"$f":"SUMPRODUCT(($AM$13:$AM$16=AM15)*($AP$13:$AP$16>AP15))","v":0},{"$f":"RANK(AM15,$AM$13:$AM$16)","v":1},"Marocko",{"$f":"SUMIF($X$13:$X$18,$AL15,$Y$13:$Y$18)+SUMIF($AB$13:$AB$18,$AL15,$AC$13:$AC$18)","v":0},{"$f":"SUMIF($X$13:$X$18,$AL15,$Z$13:$Z$18)+SUMIF($AB$13:$AB$18,AL15,$AD$13:$AD$18)","v":0},{"$f":"SUMIF($X$13:$X$18,$AL15,$AA$13:$AA$18)+SUMIF($AB$13:$AB$18,$AL15,$AE$13:$AE$18)","v":0},{"$f":"AN15-AO15","v":0},null,3,{"$f":"VLOOKUP($AR15,$AG$13:$AP$16,6,FALSE)","v":"Marocko"},{"$f":"VLOOKUP($AS15,$AL$13:$AP$16,2,FALSE)","v":0},{"$f":"VLOOKUP($AS15,$AL$13:$AP$16,3,FALSE)","v":0},{"$f":"VLOOKUP($AS15,$AL$13:$AP$16,4,FALSE)","v":0},{"$f":"VLOOKUP($AS15,$AL$13:$AP$16,5,FALSE)","v":0},19,"2014-06-18T16:00:00","Spanien","-","Chile",{"$f":"IF(G15=#REF!,2,0)","v":{"$error":"#REF!"}},"-",{"$f":"IF(I15=#REF!,2,0)","v":{"$error":"#REF!"}},{"$f":"IF(J15=#REF!,2,0)","v":{"$error":"#REF!"}},{"$error":"#REF!"},null,null,null,null,null,null,null,12]
[null,20,"2018-06-20","Iran","-","Spanien",null,"-",null,"",4,{"$f":"VLOOKUP(K16,$AR$13:$AW$16,2,FALSE)","v":"Iran"},{"$f":"VLOOKUP(L16,$AS$13:$AW$16,2,FALSE)","v":0},{"$f":"VLOOKUP(L16,$AS$13:$AW$16,3,FALSE)","v":0},{"$f":"VLOOKUP(L16,$AS$13:$AW$16,4,FALSE)","v":0},{"$f":"VLOOKUP(L16,$AS$13:$AW$16,5,FALSE)","v":0},null,null,null,null,null,null,null,"Iran",0,0,0,"Spanien",0,0,0,null,{"$f":"RANK($AH16,$AH$13:$AH$16,1)+COUNTIF($AH$13:$AH16,$AH16)-1","v":4},{"$f":"AI16+AJ16+AK16","v":1},{"$f":"SUMPRODUCT(($AM$13:$AM$16=AM16)*($AP$13:$AP$16=AP16)*($AN$13:$AN$16>AN16))","v":0},{"$f":"SUMPRODUCT(($AM$13:$AM$16=AM16)*($AP$13:$AP$16>AP16))","v":0},{"$f":"RANK(AM16,$AM$13:$AM$16)","v":1},"Iran",{"$f":"SUMIF($X$13:$X$18,$AL16,$Y$13:$Y$18)+SUMIF($AB$13:$AB$18,$AL16,$AC$13:$AC$18)","v":0},{"$f":"SUMIF($X$13:$X$18,$AL16,$Z$13:$Z$18)+SUMIF($AB$13:$AB$18,AL16,$AD$13:$AD$18)","v":0},{"$f":"SUMIF($X$13:$X$18,$AL16,$AA$13:$AA$18)+SUMIF($AB$13:$AB$18,$AL16,$AE$13:$AE$18)","v":0},{"$f":"AN16-AO16","v":0},null,4,{"$f":"VLOOKUP($AR16,$AG$13:$AP$16,6,FALSE)","v":"Iran"},{"$f":"VLOOKUP($AS16,$AL$13:$AP$16,2,FALSE)","v":0},{"$f":"VLOOKUP($AS16,$AL$13:$AP$16,3,FALSE)","v":0},{"$f":"VLOOKUP($AS16,$AL$13:$AP$16,4,FALSE)","v":0},{"$f":"VLOOKUP($AS16,$AL$13:$AP$16,5,FALSE)","v":0},20,"2014-06-18T13:00:00","Australien","-","Holland",{"$f":"IF(G16=#REF!,2,0)","v":{"$error":"#REF!"}},"-",{"$f":"IF(I16=#REF!,2,0)","v":{"$error":"#REF!"}},{"$f":"IF(J16=#REF!,2,0)","v":{"$error":"#REF!"}},{"$error":"#REF!"},null,null,null,null,null,null,null,13]
[null,35,"2018-06-25","Iran","-","Portugal",null,"-",null,"",null,null,null,null,null,null,null,null,null,null,null,null,null,"Iran",0,0,0,"Portugal",0,0,0,null,null,null,null,null,null,null,null,null,null,null,null,null,null,null,null,null,null,35,"2014-06-23T13:00:00","Australien","-","Spanien",{"$f":"IF(G17=#REF!,2,0)","v":{"$error":"#REF!"}},"-",{"$f":"IF(I17=#REF!,2,0)","v":{"$error":"#REF!"}},{"$f":"IF(J17=#REF!,2,0)","v":{"$error":"#REF!"}},{"$error":"#REF!"},null,null,null,null,null,null,null,14]
[null,36,"2018-06-25","Spanien","-","Marocko",null,"-",null,"",null,null,null,null,null,null,null,null,null,null,null,null,null,"Spanien",0,0,0,"Marocko",0,0,0,null,null,null,null,null,null,null,null,null,null,null,null,null,null,null,null,null,null,36,"2014-06-23T13:00:00","Holland","-","Chile",{"$f":"IF(G18=#REF!,2,0)","v":{"$error":"#REF!"}},"-",{"$f":"IF(I18=#REF!,2,0)","v":{"$error":"#REF!"}},{"$f":"IF(J18=#REF!,2,0)","v":{"$error":"#REF!"}},{"$error":"#REF!"},null,null,null,null,null,null,null,15]
[null,null,null,null,null,null,null,null,null,null,null,null,null,null,null,null,null,null,null,null,null,null,null,null,null,null,null,null,null,null,null,null,null,null,null,null,null,null,null,null,null,null,null,null,null,null,null,null,null,null,null,null,null,null,null,null,null,null,null,null,null,null,null,null,null,null,16]
[null,"Grupp C",null,null,null,null,null,null,null,null,null,null,null,null,null,null,null,null,null,null,null,null,null,null,null,null,null,null,null,null,null,null,null,null,null,null,null,null,null,null,null,null,null,null,null,null,null,null,null,"Grupp C",null,null,null,null,null,null,null,null,null,null,null,null,null,null,null,null,17]
[null,"Match","Datum","Match",null,null,"Resultat",null,null,"Tecken",null,"Grupp C","Poäng","GM","IM"," +/-",null,null,null,null,null,null,null,"Lag 1","Poäng","GM","IM","Lag 2","Poäng","GM","IM",null,"Rank ties","Rank total","Rank mål","Rank Diff","Rank Poäng","Lag","Poäng","GM","IM","Diff",null,"Rank","Lag","Poäng","GM","IM","Diff","Match","Datum","Match",null,null,"Resultat",null,null,"Tecken","Poäng",null,null,null,null,null,null,null,18]
[null,5,"2018-06-16","Frankrike","-","Australien",null,"-",null,{"$f":"IF(OR(ISBLANK(G22),ISBLANK(I22)),\"\",IF(G22>I22,1,IF(G22<I22,2,\"X\")))","v":""},1,{"$f":"VLOOKUP(K22,$AR$22:$AW$25,2,FALSE)","v":"Frankrike"},{"$f":"VLOOKUP(L22,$AS$22:$AW$25,2,FALSE)","v":0},{"$f":"VLOOKUP(L22,$AS$22:$AW$25,3,FALSE)","v":0},{"$f":"VLOOKUP(L22,$AS$22:$AW$25,4,FALSE)","v":0},{"$f":"VLOOKUP(L22,$AS$22:$AW$25,5,FALSE)","v":0},null,null,null,null,null,null,null,{"$f":"D22","v":"Frankrike"},{"$f":"IF(G22=\"\",0,IF($G22<$I22,0,IF($G22=$I22,1,3)))","v":0},{"$f":"G22","v":0},{"$f":"I22","v":0},{"$f":"F22","v":"Australien"},{"$f":"IF(I22=\"\",0,IF(I22<G22,0,IF(I22=G22,1,3)))","v":0},{"$f":"I22","v":0},{"$f":"G22","v":0},null,{"$f":"RANK($AH22,$AH$22:$AH$25,1)+COUNTIF($AH$22:$AH22,$AH22)-1","v":1},{"$f":"AI22+AJ22+AK22","v":1},{"$f":"SUMPRODUCT(($AM$22:$AM$25=AM22)*($AP$22:$AP$25=AP22)*($AN$22:$AN$25>AN22))","v":0},{"$f":"SUMPRODUCT(($AM$22:$AM$25=AM22)*($AP$22:$AP$25>AP22))","v":0},{"$f":"RANK(AM22,$AM$22:$AM$25)","v":1},"Frankrike",{"$f":"SUMIF($X$22:$X$27,$AL22,$Y$22:$Y$27)+SUMIF($AB$22:$AB$27,$AL22,$AC$22:$AC$27)","v":0},{"$f":"SUMIF($X$22:$X$27,$AL22,$Z$22:$Z$27)+SUMIF($AB$22:$AB$27,$AL22,$AD$22:$AD$27)","v":0},{"$f":"SUMIF($X$22:$X$27,$AL22,$AA$22:$AA$27)+SUMIF($AB$22:$AB$27,$AL22,$AE$22:$AE$27)","v":0},{"$f":"AN22-AO22","v":0},null,1,{"$f":"VLOOKUP($AR22,$AG$22:$AP$25,6,FALSE)","v":"Frankrike"},{"$f":"VLOOKUP($AS22,$AL$22:$AP$25,2,FALSE)","v":0},{"$f":"VLOOKUP($AS22,$AL$22:$AP$25,3,FALSE)","v":0},{"$f":"VLOOKUP($AS22,$AL$22:$AP$25,4,FALSE)","v":0},{"$f":"VLOOKUP($AS22,$AL$22:$AP$25,5,FALSE)","v":0},5,"2014-06-14T13:00:00","Colombia","-","Grekland",{"$f":"IF(G22=#REF!,2,0)","v":{"$error":"#REF!"}},"-",{"$f":"IF(I22=#REF!,2,0)","v":{"$error":"#REF!"}},{"$f":"IF(J22=#REF!,2,0)","v":{"$error":"#REF!"}},{"$f":"SUM(BC22+BE22+BF22)","v":{"$error":"#REF!"}},null,null,null,null,null,null,null,19]
[null,6,"2018-06-16","Peru","-","Danmark",null,"-",null,{"$f":"IF(OR(ISBLANK(G23),ISBLANK(I23)),\"\",IF(G23>I23,1,IF(G23<I23,2,\"X\")))","v":""},2,{"$f":"VLOOKUP(K23,$AR$22:$AW$25,2,FALSE)","v":"Australien"},{"$f":"VLOOKUP(L23,$AS$22:$AW$25,2,FALSE)","v":0},{"$f":"VLOOKUP(L23,$AS$22:$AW$25,3,FALSE)","v":0},{"$f":"VLOOKUP(L23,$AS$22:$AW$25,4,FALSE)","v":0},{"$f":"VLOOKUP(L23,$AS$22:$AW$25,5,FALSE)","v":0},null,null,null,null,null,null,null,{"$f":"D23","v":"Peru"},0,0,0,{"$f":"F23","v":"Danmark"},0,0,0,null,{"$f":"RANK($AH23,$AH$22:$AH$25,1)+COUNTIF($AH$22:$AH23,$AH23)-1","v":2},{"$f":"AI23+AJ23+AK23","v":1},{"$f":"SUMPRODUCT(($AM$22:$AM$25=AM23)*($AP$22:$AP$25=AP23)*($AN$22:$AN$25>AN23))","v":0},{"$f":"SUMPRODUCT(($AM$22:$AM$25=AM23)*($AP$22:$AP$25>AP23))","v":0},{"$f":"RANK(AM23,$AM$22:$AM$25)","v":1},"Australien",{"$f":"SUMIF($X$22:$X$27,$AL23,$Y$22:$Y$27)+SUMIF($AB$22:$AB$27,$AL23,$AC$22:$AC$27)","v":0},{"$f":"SUMIF($X$22:$X$27,$AL23,$Z$22:$Z$27)+SUMIF($AB$22:$AB$27,$AL23,$AD$22:$AD$27)","v":0},{"$f":"SUMIF($X$22:$X$27,$AL23,$AA$22:$AA$27)+SUMIF($AB$22:$AB$27,$AL23,$AE$22:$AE$27)","v":0},{"$f":"AN23-AO23","v":0},null,2,{"$f":"VLOOKUP($AR23,$AG$22:$AP$25,6,FALSE)","v":"Australien"},{"$f":"VLOOKUP($AS23,$AL$22:$AP$25,2,FALSE)","v":0},{"$f":"VLOOKUP($AS23,$AL$22:$AP$25,3,FALSE)","v":0},{"$f":"VLOOKUP($AS23,$AL$22:$AP$25,4,FALSE)","v":0},{"$f":"VLOOKUP($AS23,$AL$22:$AP$25,5,FALSE)","v":0},6,"2014-06-15","Elfenbenskusten","-","Japan",{"$f":"IF(G23=#REF!,2,0)","v":{"$error":"#REF!"}},"-",{"$f":"IF(I23=#REF!,2,0)","v":{"$error":"#REF!"}},{"$f":"IF(J23=#REF!,2,0)","v":{"$error":"#REF!"}},{"$error":"#REF!"},null,null,null,null,null,null,null,20]
[null,22,"2018-06-21","Danmark","-","Australien",null,"-",null,"",3,{"$f":"VLOOKUP(K24,$AR$22:$AW$25,2,FALSE)","v":"Peru"},{"$f":"VLOOKUP(L24,$AS$22:$AW$25,2,FALSE)","v":0},{"$f":"VLOOKUP(L24,$AS$22:$AW$25,3,FALSE)","v":0},{"$f":"VLOOKUP(L24,$AS$22:$AW$25,4,FALSE)","v":0},{"$f":"VLOOKUP(L24,$AS$22:$AW$25,5,FALSE)","v":0},null,null,null,null,null,null,null,"Danmark",0,0,0,"Australien",0,0,0,null,{"$f":"RANK($AH24,$AH$22:$AH$25,1)+COUNTIF($AH$22:$AH24,$AH24)-1","v":3},{"$f":"AI24+AJ24+AK24","v":1},0,0,1,"Peru",0,0,0,0,null,3,"Peru",0,0,0,0,21,"2014-06-19T13:00:00","Colombia","-","Elfenbenskusten",{"$f":"IF(G24=#REF!,2,0)","v":{"$error":"#REF!"}},"-",{"$f":"IF(I24=#REF!,2,0)","v":{"$error":"#REF!"}},{"$f":"IF(J24=#REF!,2,0)","v":{"$error":"#REF!"}},{"$error":"#REF!"},null,null,null,null,null,null,null,21]
[null,21,"2018-06-21","Frankrike","-","Peru",null,"-",null,"",4,{"$f":"VLOOKUP(K25,$AR$22:$AW$25,2,FALSE)","v":"Danmark"},{"$f":"VLOOKUP(L25,$AS$22:$AW$25,2,FALSE)","v":0},{"$f":"VLOOKUP(L25,$AS$22:$AW$25,3,FALSE)","v":0},{"$f":"VLOOKUP(L25,$AS$22:$AW$25,4,FALSE)","v":0},{"$f":"VLOOKUP(L25,$AS$22:$AW$25,5,FALSE)","v":0},null,null,null,null,null,null,null,"Frankrike",0,0,0,"Peru",0,0,0,null,{"$f":"RANK($AH25,$AH$22:$AH$25,1)+COUNTIF($AH$22:$AH25,$AH25)-1","v":4},{"$f":"AI25+AJ25+AK25","v":1},0,0,1,"Danmark",0,0,0,0,null,4,"Danmark",0,0,0,0,22,"2014-06-19T19:00:00","Japan","-","Grekland",{"$f":"IF(G25=#REF!,2,0)","v":{"$error":"#REF!"}},"-",{"$f":"IF(I25=#REF!,2,0)","v":{"$error":"#REF!"}},{"$f":"IF(J25=#REF!,2,0)","v":{"$error":"#REF!"}},{"$error":"#REF!"},null,null,null,null,null,null,null,22]
[null,37,"2018-06-26","Danmark","-","Frankrike",null,"-",null,"",null,null,null,null,null,null,null,null,null,null,null,null,null,"Danmark",0,0,0,"Frankrike",0,0,0,null,null,null,null,null,null,null,null,null,null,null,null,null,null,null,null,null,null,37,"2014-06-24T16:00:00","Japan","-","Colombia",{"$f":"IF(G26=#REF!,2,0)","v":{"$error":"#REF!"}},"-",{"$f":"IF(I26=#REF!,2,0)","v":{"$error":"#REF!"}},{"$f":"IF(J26=#REF!,2,0)","v":{"$error":"#REF!"}},{"$error":"#REF!"},null,null,null,null,null,null,null,23]
[null,38,"2018-06-26","Australien","-","Peru",null,"-",null,"",null,null,null,null,null,null,null,null,null,null,null,null,null,"Australien",0,0,0,"Peru",0,0,0,null,null,null,null,null,null,null,null,null,null,null,null,null,null,null,null,null,null,38,"2014-06-24T17:00:00","Grekland","-","Elfenbenskusten",{"$f":"IF(G27=#REF!,2,0)","v":{"$error":"#REF!"}},"-",{"$f":"IF(I27=#REF!,2,0)","v":{"$error":"#REF!"}},{"$f":"IF(J27=#REF!,2,0)","v":{"$error":"#REF!"}},{"$error":"#REF!"},null,null,null,null,null,null,null,24]
[null,null,null,null,null,null,null,null,null,null,null,null,null,null,null,null,null,null,null,null,null,null,null,null,null,null,null,null,null,null,null,null,null,null,null,null,null,null,null,null,null,null,null,null,null,null,null,null,null,null,null,null,null,null,null,null,null,null,null,null,null,null,null,null,null,null,25]
[null,"Grupp D",null,null,null,null,null,null,null,null,null,null,null,null,null,null,null,null,null,null,null,null,null,null,null,null,null,null,null,null,null,null,null,null,null,null,null,null,null,null,null,null,null,null,null,null,null,null,null,"Grupp D",null,null,null,null,null,null,null,null,null,null,null,null,null,null,null,null,26]
[null,"Match","Datum","Match",null,null,"Resultat",null,null,"Tecken",null,"Grupp D","Poäng","GM","IM"," +/-",null,null,null,null,null,null,null,"Lag 1","Poäng","GM","IM","Lag 2","Poäng","GM","IM",null,"Rank ties","Rank total","Rank mål","Rank Diff","Rank Poäng","Lag","Poäng","GM","IM","Diff",null,"Rank","Lag","Poäng","GM","IM","Diff","Match","Datum","Match",null,null,"Resultat",null,null,"Tecken","Poäng",null,null,null,null,null,null,null,27]
[null,7,"2018-06-16","Argentina","-","Island",null,"-",null,{"$f":"IF(OR(ISBLANK(G31),ISBLANK(I31)),\"\",IF(G31>I31,1,IF(G31<I31,2,\"X\")))","v":""},1,{"$f":"VLOOKUP(K31,$AR$31:$AW$34,2,FALSE)","v":"Argentina"},{"$f":"VLOOKUP(L31,$AS$31:$AW$34,2,FALSE)","v":0},{"$f":"VLOOKUP(L31,$AS$31:$AW$34,3,FALSE)","v":0},{"$f":"VLOOKUP(L31,$AS$31:$AW$34,4,FALSE)","v":0},{"$f":"VLOOKUP(L31,$AS$31:$AW$34,5,FALSE)","v":0},null,null,null,null,null,null,null,{"$f":"D31","v":"Argentina"},{"$f":"IF(G31=\"\",0,IF($G31<$I31,0,IF($G31=$I31,1,3)))","v":0},{"$f":"G31","v":0},{"$f":"I31","v":0},{"$f":"F31","v":"Island"},{"$f":"IF(I31=\"\",0,IF(I31<G31,0,IF(I31=G31,1,3)))","v":0},{"$f":"I31","v":0},{"$f":"G31","v":0},null,{"$f":"RANK($AH31,$AH$31:$AH$34,1)+COUNTIF($AH$31:$AH31,$AH31)-1","v":1},{"$f":"AI31+AJ31+AK31","v":1},{"$f":"SUMPRODUCT(($AM$31:$AM$34=AM31)*($AP$31:$AP$34=AP31)*($AN$31:$AN$34>AN31))","v":0},{"$f":"SUMPRODUCT(($AM$31:$AM$34=AM31)*($AP$31:$AP$34>AP31))","v":0},{"$f":"RANK(AM31,$AM$31:$AM$34)","v":1},"Argentina",{"$f":"SUMIF($X$31:$X$36,$AL31,$Y$31:$Y$36)+SUMIF($AB$31:$AB$36,$AL31,$AC$31:$AC$36)","v":0},{"$f":"SUMIF($X$31:$X$36,$AL31,$Z$31:$Z$36)+SUMIF($AB$31:$AB$36,$AL31,$AD$31:$AD$36)","v":0},{"$f":"SUMIF($X$31:$X$36,$AL31,$AA$31:$AA$36)+SUMIF($AB$31:$AB$36,$AL31,$AE$31:$AE$36)","v":0},{"$f":"AN31-AO31","v":0},null,1,{"$f":"VLOOKUP($AR31,$AG$31:$AP$34,6,FALSE)","v":"Argentina"},{"$f":"VLOOKUP($AS31,$AL$31:$AP$34,2,FALSE)","v":0},{"$f":"VLOOKUP($AS31,$AL$31:$AP$34,3,FALSE)","v":0},{"$f":"VLOOKUP($AS31,$AL$31:$AP$34,4,FALSE)","v":0},{"$f":"VLOOKUP($AS31,$AL$31:$AP$34,5,FALSE)","v":0},7,"2014-06-14T16:00:00","Uruguay","-","Costa Rica",{"$f":"IF(G31=#REF!,2,0)","v":{"$error":"#REF!"}},"-",{"$f":"IF(I31=#REF!,2,0)","v":{"$error":"#REF!"}},{"$f":"IF(J31=#REF!,2,0)","v":{"$error":"#REF!"}},{"$f":"SUM(BC31+BE31+BF31)","v":{"$error":"#REF!"}},null,null,null,null,null,null,null,28]
[null,8,"2018-06-16","Kroatien","-","Nigeria",null,"-",null,{"$f":"IF(OR(ISBLANK(G32),ISBLANK(I32)),\"\",IF(G32>I32,1,IF(G32<I32,2,\"X\")))","v":""},2,{"$f":"VLOOKUP(K32,$AR$31:$AW$34,2,FALSE)","v":"Island"},{"$f":"VLOOKUP(L32,$AS$31:$AW$34,2,FALSE)","v":0},{"$f":"VLOOKUP(L32,$AS$31:$AW$34,3,FALSE)","v":0},{"$f":"VLOOKUP(L32,$AS$31:$AW$34,4,FALSE)","v":0},{"$f":"VLOOKUP(L32,$AS$31:$AW$34,5,FALSE)","v":0},null,null,null,null,null,null,null,{"$f":"D32","v":"Kroatien"},0,0,0,{"$f":"F32","v":"Nigeria"},0,0,0,null,{"$f":"RANK($AH32,$AH$31:$AH$34,1)+COUNTIF($AH$31:$AH32,$AH32)-1","v":2},{"$f":"AI32+AJ32+AK32","v":1},{"$f":"SUMPRODUCT(($AM$31:$AM$34=AM32)*($AP$31:$AP$34=AP32)*($AN$31:$AN$34>AN32))","v":0},{"$f":"SUMPRODUCT(($AM$31:$AM$34=AM32)*($AP$31:$AP$34>AP32))","v":0},{"$f":"RANK(AM32,$AM$31:$AM$34)","v":1},"Island",{"$f":"SUMIF($X$31:$X$36,$AL32,$Y$31:$Y$36)+SUMIF($AB$31:$AB$36,$AL32,$AC$31:$AC$36)","v":0},{"$f":"SUMIF($X$31:$X$36,$AL32,$Z$31:$Z$36)+SUMIF($AB$31:$AB$36,$AL32,$AD$31:$AD$36)","v":0},{"$f":"SUMIF($X$31:$X$36,$AL32,$AA$31:$AA$36)+SUMIF($AB$31:$AB$36,$AL32,$AE$31:$AE$36)","v":0},{"$f":"AN32-AO32","v":0},null,2,{"$f":"VLOOKUP($AR32,$AG$31:$AP$34,6,FALSE)","v":"Island"},{"$f":"VLOOKUP($AS32,$AL$31:$AP$34,2,FALSE)","v":0},{"$f":"VLOOKUP($AS32,$AL$31:$AP$34,3,FALSE)","v":0},{"$f":"VLOOKUP($AS32,$AL$31:$AP$34,4,FALSE)","v":0},{"$f":"VLOOKUP($AS32,$AL$31:$AP$34,5,FALSE)","v":0},8,"2014-06-14T18:00:00","England","-","Italien",{"$f":"IF(G32=#REF!,2,0)","v":{"$error":"#REF!"}},"-",{"$f":"IF(I32=#REF!,2,0)","v":{"$error":"#REF!"}},{"$f":"IF(J32=#REF!,2,0)","v":{"$error":"#REF!"}},{"$error":"#REF!"},null,null,null,null,null,null,null,29]
[null,23,"2018-06-21","Argentina","-","Kroatien",null,"-",null,"",3,{"$f":"VLOOKUP(K33,$AR$31:$AW$34,2,FALSE)","v":"Kroatien"},{"$f":"VLOOKUP(L33,$AS$31:$AW$34,2,FALSE)","v":0},{"$f":"VLOOKUP(L33,$AS$31:$AW$34,3,FALSE)","v":0},{"$f":"VLOOKUP(L33,$AS$31:$AW$34,4,FALSE)","v":0},{"$f":"VLOOKUP(L33,$AS$31:$AW$34,5,FALSE)","v":0},null,null,null,null,null,null,null,"Argentina",0,0,0,"Kroatien",0,0,0,null,{"$f":"RANK($AH33,$AH$31:$AH$34,1)+COUNTIF($AH$31:$AH33,$AH33)-1","v":3},{"$f":"AI33+AJ33+AK33","v":1},0,0,1,"Kroatien",0,0,0,0,null,3,"Kroatien",0,0,0,0,23,"2014-06-19T16:00:00","Uruguay","-","England",{"$f":"IF(G33=#REF!,2,0)","v":{"$error":"#REF!"}},"-",{"$f":"IF(I33=#REF!,2,0)","v":{"$error":"#REF!"}},{"$f":"IF(J33=#REF!,2,0)","v":{"$error":"#REF!"}},{"$error":"#REF!"},null,null,null,null,null,null,null,30]
[null,24,"2018-06-22","Nigeria","-","Island",null,"-",null,"",4,{"$f":"VLOOKUP(K34,$AR$31:$AW$34,2,FALSE)","v":"Nigeria"},{"$f":"VLOOKUP(L34,$AS$31:$AW$34,2,FALSE)","v":0},{"$f":"VLOOKUP(L34,$AS$31:$AW$34,3,FALSE)","v":0},{"$f":"VLOOKUP(L34,$AS$31:$AW$34,4,FALSE)","v":0},{"$f":"VLOOKUP(L34,$AS$31:$AW$34,5,FALSE)","v":0},null,null,null,null,null,null,null,"Nigeria",0,0,0,"Island",0,0,0,null,{"$f":"RANK($AH34,$AH$31:$AH$34,1)+COUNTIF($AH$31:$AH34,$AH34)-1","v":4},{"$f":"AI34+AJ34+AK34","v":1},0,0,1,"Nigeria",0,0,0,0,null,4,"Nigeria",0,0,0,0,24,"2014-06-20T13:00:00","Italien","-","Costa Rica",{"$f":"IF(G34=#REF!,2,0)","v":{"$error":"#REF!"}},"-",{"$f":"IF(I34=#REF!,2,0)","v":{"$error":"#REF!"}},{"$f":"IF(J34=#REF!,2,0)","v":{"$error":"#REF!"}},{"$error":"#REF!"},null,null,null,null,null,null,null,31]
[null,39,"2018-06-26","Nigeria","-","Argentina",null,"-",null,"",null,null,null,null,null,null,null,null,null,null,null,null,null,"Nigeria",0,0,0,"Argentina",0,0,0,null,null,null,null,null,null,null,null,null,null,null,null,null,null,null,null,null,null,39,"2014-06-24T13:00:00","Italien","-","Uruguay",{"$f":"IF(G35=#REF!,2,0)","v":{"$error":"#REF!"}},"-",{"$f":"IF(I35=#REF!,2,0)","v":{"$error":"#REF!"}},{"$f":"IF(J35=#REF!,2,0)","v":{"$error":"#REF!"}},{"$error":"#REF!"},null,null,null,null,null,null,null,32]
[null,40,"2018-06-26","Island","-","Kroatien",null,"-",null,"",null,null,null,null,null,null,null,null,null,null,null,null,null,"Island",0,0,0,"Kroatien",0,0,0,null,null,null,null,null,null,null,null,null,null,null,null,null,null,null,null,null,null,40,"2014-06-24T13:00:00","Costa Rica","-","England",{"$f":"IF(G36=#REF!,2,0)","v":{"$error":"#REF!"}},"-",{"$f":"IF(I36=#REF!,2,0)","v":{"$error":"#REF!"}},{"$f":"IF(J36=#REF!,2,0)","v":{"$error":"#REF!"}},{"$error":"#REF!"},null,null,null,null,null,null,null,33]
[null,null,null,null,null,null,null,null,null,null,null,null,null,null,null,null,null,null,null,null,null,null,null,null,null,null,null,null,null,null,null,null,null,null,null,null,null,null,null,null,null,null,null,null,null,null,null,null,null,null,null,null,null,null,null,null,null,null,null,null,null,null,null,null,null,null,34]
[null,"Grupp E",null,null,null,null,null,null,null,null,null,null,null,null,null,null,null,null,null,null,null,null,null,null,null,null,null,null,null,null,null,null,null,null,null,null,null,null,null,null,null,null,null,null,null,null,null,null,null,"Grupp E",null,null,null,null,null,null,null,null,null,null,null,null,null,null,null,null,35]
[null,"Match","Datum","Match",null,null,"Resultat",null,null,"Tecken",null,"Grupp E","Poäng","GM","IM"," +/-",null,null,null,null,null,null,null,"Lag 1","Poäng","GM","IM","Lag 2","Poäng","GM","IM",null,"Rank ties","Rank total","Rank mål","Rank Diff","Rank Poäng","Lag","Poäng","GM","IM","Diff",null,"Rank","Lag","Poäng","GM","IM","Diff","Match","Datum","Match",null,null,"Resultat",null,null,"Tecken","Poäng",null,null,null,null,null,null,null,36]
[null,10,"2018-06-17","Costa Rica","-","Serbien",null,"-",null,{"$f":"IF(OR(ISBLANK(G40),ISBLANK(I40)),\"\",IF(G40>I40,1,IF(G40<I40,2,\"X\")))","v":""},1,{"$f":"VLOOKUP(K40,$AR$40:$AW$43,2,FALSE)","v":"Brasilien"},{"$f":"VLOOKUP(L40,$AS$40:$AW$43,2,FALSE)","v":0},{"$f":"VLOOKUP(L40,$AS$40:$AW$43,3,FALSE)","v":0},{"$f":"VLOOKUP(L40,$AS$40:$AW$43,4,FALSE)","v":0},{"$f":"VLOOKUP(L40,$AS$40:$AW$43,5,FALSE)","v":0},null,null,null,null,null,null,null,{"$f":"D40","v":"Costa Rica"},{"$f":"IF(G40=\"\",0,IF($G40<$I40,0,IF($G40=$I40,1,3)))","v":0},{"$f":"G40","v":0},{"$f":"I40","v":0},{"$f":"F40","v":"Serbien"},{"$f":"IF(I40=\"\",0,IF(I40<G40,0,IF(I40=G40,1,3)))","v":0},{"$f":"I40","v":0},{"$f":"G40","v":0},null,{"$f":"RANK($AH40,$AH$40:$AH$43,1)+COUNTIF($AH$40:$AH40,$AH40)-1","v":1},{"$f":"AI40+AJ40+AK40","v":1},{"$f":"SUMPRODUCT(($AM$40:$AM$43=AM40)*($AP$40:$AP$43=AP40)*($AN$40:$AN$43>AN40))","v":0},{"$f":"SUMPRODUCT(($AM$40:$AM$43=AM40)*($AP$40:$AP$43>AP40))","v":0},{"$f":"RANK(AM40,$AM$40:$AM$43)","v":1},"Brasilien",{"$f":"SUMIF($X$40:$X$45,$AL40,$Y$40:$Y$45)+SUMIF($AB$40:$AB$45,$AL40,$AC$40:$AC$45)","v":0},{"$f":"SUMIF($X$40:$X$45,$AL40,$Z$40:$Z$45)+SUMIF($AB$40:$AB$45,$AL40,$AD$40:$AD$45)","v":0},{"$f":"SUMIF($X$40:$X$45,$AL40,$AA$40:$AA$45)+SUMIF($AB$40:$AB$45,$AL40,$AE$40:$AE$45)","v":0},{"$f":"AN40-AO40","v":0},null,1,{"$f":"VLOOKUP($AR40,$AG$40:$AP$43,6,FALSE)","v":"Brasilien"},{"$f":"VLOOKUP($AS40,$AL$40:$AP$43,2,FALSE)","v":0},{"$f":"VLOOKUP($AS40,$AL$40:$AP$43,3,FALSE)","v":0},{"$f":"VLOOKUP($AS40,$AL$40:$AP$43,4,FALSE)","v":0},{"$f":"VLOOKUP($AS40,$AL$40:$AP$43,5,FALSE)","v":0},9,"2014-06-15T13:00:00","Schweiz","-","Ecuador",{"$f":"IF(G40=#REF!,2,0)","v":{"$error":"#REF!"}},"-",{"$f":"IF(I40=#REF!,2,0)","v":{"$error":"#REF!"}},{"$f":"IF(J40=#REF!,2,0)","v":{"$error":"#REF!"}},{"$f":"SUM(BC40+BE40+BF40)","v":{"$error":"#REF!"}},null,null,null,null,null,null,null,37]
[null,9,"2018-06-17","Brasilien","-","Schweiz",null,"-",null,{"$f":"IF(OR(ISBLANK(G41),ISBLANK(I41)),\"\",IF(G41>I41,1,IF(G41<I41,2,\"X\")))","v":""},2,{"$f":"VLOOKUP(K41,$AR$40:$AW$43,2,FALSE)","v":"Schweiz"},{"$f":"VLOOKUP(L41,$AS$40:$AW$43,2,FALSE)","v":0},{"$f":"VLOOKUP(L41,$AS$40:$AW$43,3,FALSE)","v":0},{"$f":"VLOOKUP(L41,$AS$40:$AW$43,4,FALSE)","v":0},{"$f":"VLOOKUP(L41,$AS$40:$AW$43,5,FALSE)","v":0},null,null,null,null,null,null,null,{"$f":"D41","v":"Brasilien"},0,0,0,{"$f":"F41","v":"Schweiz"},0,0,0,null,{"$f":"RANK($AH41,$AH$40:$AH$43,1)+COUNTIF($AH$40:$AH41,$AH41)-1","v":2},{"$f":"AI41+AJ41+AK41","v":1},{"$f":"SUMPRODUCT(($AM$40:$AM$43=AM41)*($AP$40:$AP$43=AP41)*($AN$40:$AN$43>AN41))","v":0},{"$f":"SUMPRODUCT(($AM$40:$AM$43=AM41)*($AP$40:$AP$43>AP41))","v":0},{"$f":"RANK(AM41,$AM$40:$AM$43)","v":1},"Schweiz",{"$f":"SUMIF($X$40:$X$45,$AL41,$Y$40:$Y$45)+SUMIF($AB$40:$AB$45,$AL41,$AC$40:$AC$45)","v":0},{"$f":"SUMIF($X$40:$X$45,$AL41,$Z$40:$Z$45)+SUMIF($AB$40:$AB$45,$AL41,$AD$40:$AD$45)","v":0},{"$f":"SUMIF($X$40:$X$45,$AL41,$AA$40:$AA$45)+SUMIF($AB$40:$AB$45,$AL41,$AE$40:$AE$45)","v":0},{"$f":"AN41-AO41","v":0},null,2,{"$f":"VLOOKUP($AR41,$AG$40:$AP$43,6,FALSE)","v":"Schweiz"},{"$f":"VLOOKUP($AS41,$AL$40:$AP$43,2,FALSE)","v":0},{"$f":"VLOOKUP($AS41,$AL$40:$AP$43,3,FALSE)","v":0},{"$f":"VLOOKUP($AS41,$AL$40:$AP$43,4,FALSE)","v":0},{"$f":"VLOOKUP($AS41,$AL$40:$AP$43,5,FALSE)","v":0},10,"2014-06-15T16:00:00","Frankrike","-","Honduras",{"$f":"IF(G41=#REF!,2,0)","v":{"$error":"#REF!"}},"-",{"$f":"IF(I41=#REF!,2,0)","v":{"$error":"#REF!"}},{"$f":"IF(J41=#REF!,2,0)","v":{"$error":"#REF!"}},{"$error":"#REF!"},null,null,null,null,null,null,null,38]
[null,25,"2018-06-22","Brasilien","-","Costa Rica",null,"-",null,"",3,{"$f":"VLOOKUP(K42,$AR$40:$AW$43,2,FALSE)","v":"Costa Rica"},{"$f":"VLOOKUP(L42,$AS$40:$AW$43,2,FALSE)","v":0},{"$f":"VLOOKUP(L42,$AS$40:$AW$43,3,FALSE)","v":0},{"$f":"VLOOKUP(L42,$AS$40:$AW$43,4,FALSE)","v":0},{"$f":"VLOOKUP(L42,$AS$40:$AW$43,5,FALSE)","v":0},null,null,null,null,null,null,null,"Brasilien",0,0,0,"Costa Rica",0,0,0,null,{"$f":"RANK($AH42,$AH$40:$AH$43,1)+COUNTIF($AH$40:$AH42,$AH42)-1","v":3},{"$f":"AI42+AJ42+AK42","v":1},0,0,1,"Costa Rica",0,0,0,0,null,3,"Costa Rica",0,0,0,0,25,"2014-06-20T16:00:00","Schweiz","-","Frankrike",{"$f":"IF(G42=#REF!,2,0)","v":{"$error":"#REF!"}},"-",{"$f":"IF(I42=#REF!,2,0)","v":{"$error":"#REF!"}},{"$f":"IF(J42=#REF!,2,0)","v":{"$error":"#REF!"}},{"$error":"#REF!"},null,null,null,null,null,null,null,39]
[null,26,"2018-06-22","Serbien","-","Schweiz",null,"-",null,"",4,{"$f":"VLOOKUP(K43,$AR$40:$AW$43,2,FALSE)","v":"Serbien"},{"$f":"VLOOKUP(L43,$AS$40:$AW$43,2,FALSE)","v":0},{"$f":"VLOOKUP(L43,$AS$40:$AW$43,3,FALSE)","v":0},{"$f":"VLOOKUP(L43,$AS$40:$AW$43,4,FALSE)","v":0},{"$f":"VLOOKUP(L43,$AS$40:$AW$43,5,FALSE)","v":0},null,null,null,null,null,null,null,"Serbien",0,0,0,"Schweiz",0,0,0,null,{"$f":"RANK($AH43,$AH$40:$AH$43,1)+COUNTIF($AH$40:$AH43,$AH43)-1","v":4},{"$f":"AI43+AJ43+AK43","v":1},0,0,1,"Serbien",0,0,0,0,null,4,"Serbien",0,0,0,0,26,"2014-06-20T19:00:00","Honduras","-","Ecuador",{"$f":"IF(G43=#REF!,2,0)","v":{"$error":"#REF!"}},"-",{"$f":"IF(I43=#REF!,2,0)","v":{"$error":"#REF!"}},{"$f":"IF(J43=#REF!,2,0)","v":{"$error":"#REF!"}},{"$error":"#REF!"},null,null,null,null,null,null,null,40]
[null,41,"2018-06-27","Serbien","-","Brasilien",null,"-",null,"",null,null,null,null,null,null,null,null,null,null,null,null,null,"Serbien",0,0,0,"Brasilien",0,0,0,null,null,null,null,null,null,null,null,null,null,null,null,null,null,null,null,null,null,41,"2014-06-25T16:00:00","Honduras","-","Schweiz",{"$f":"IF(G44=#REF!,2,0)","v":{"$error":"#REF!"}},"-",{"$f":"IF(I44=#REF!,2,0)","v":{"$error":"#REF!"}},{"$f":"IF(J44=#REF!,2,0)","v":{"$error":"#REF!"}},{"$error":"#REF!"},null,null,null,null,null,null,null,41]
[null,42,"2018-06-27","Schweiz","-","Costa Rica",null,"-",null,"",null,null,null,null,null,null,null,null,null,null,null,null,null,"Schweiz",0,0,0,"Costa Rica",0,0,0,null,null,null,null,null,null,null,null,null,null,null,null,null,null,null,null,null,null,42,"2014-06-25T17:00:00","Ecuador","-","Frankrike",{"$f":"IF(G45=#REF!,2,0)","v":{"$error":"#REF!"}},"-",{"$f":"IF(I45=#REF!,2,0)","v":{"$error":"#REF!"}},{"$f":"IF(J45=#REF!,2,0)","v":{"$error":"#REF!"}},{"$error":"#REF!"},null,null,null,null,null,null,null,42]
[null,null,null,null,null,null,null,null,null,null,null,null,null,null,null,null,null,null,null,null,null,null,null,null,null,null,null,null,null,null,null,null,null,null,null,null,null,null,null,null,null,null,null,null,null,null,null,null,null,null,null,null,null,null,null,null,null,null,null,null,null,null,null,null,null,null,43]
[null,"Grupp F",null,null,null,null,null,null,null,null,null,null,null,null,null,null,null,null,null,null,null,null,null,null,null,null,null,null,null,null,null,null,null,null,null,null,null,null,null,null,null,null,null,null,null,null,null,null,null,"Grupp F",null,null,null,null,null,null,null,null,null,null,null,null,null,null,null,null,44]
[null,"Match","Datum","Match",null,null,"Resultat",null,null,"Tecken",null,"Grupp F","Poäng","GM","IM"," +/-",null,null,null,null,null,null,null,"Lag 1","Poäng","GM","IM","Lag 2","Poäng","GM","IM",null,"Rank ties","Rank total","Rank mål","Rank Diff","Rank Poäng","Lag","Poäng","GM","IM","Diff",null,"Rank","Lag","Poäng","GM","IM","Diff","Match","Datum","Match",null,null,"Resultat",null,null,"Tecken","Poäng",null,null,null,null,null,null,null,45]
[null,11,"2018-06-17","Tyskland","-","Mexico",null,"-",null,{"$f":"IF(OR(ISBLANK(G49),ISBLANK(I49)),\"\",IF(G49>I49,1,IF(G49<I49,2,\"X\")))","v":""},1,{"$f":"VLOOKUP(K49,$AR$49:$AW$52,2,FALSE)","v":"Tyskland"},{"$f":"VLOOKUP(L49,$AS$49:$AW$52,2,FALSE)","v":0},{"$f":"VLOOKUP(L49,$AS$49:$AW$52,3,FALSE)","v":0},{"$f":"VLOOKUP(L49,$AS$49:$AW$52,4,FALSE)","v":0},{"$f":"VLOOKUP(L49,$AS$49:$AW$52,5,FALSE)","v":0},null,null,null,null,null,null,null,{"$f":"D49","v":"Tyskland"},{"$f":"IF(G49=\"\",0,IF($G49<$I49,0,IF($G49=$I49,1,3)))","v":0},{"$f":"G49","v":0},{"$f":"I49","v":0},{"$f":"F49","v":"Mexico"},{"$f":"IF(I49=\"\",0,IF(I49<G49,0,IF(I49=G49,1,3)))","v":0},{"$f":"I49","v":0},{"$f":"G49","v":0},null,{"$f":"RANK($AH49,$AH$49:$AH$52,1)+COUNTIF($AH$49:$AH49,$AH49)-1","v":1},{"$f":"AI49+AJ49+AK49","v":1},{"$f":"SUMPRODUCT(($AM$49:$AM$52=AM49)*($AP$49:$AP$52=AP49)*($AN$49:$AN$52>AN49))","v":0},{"$f":"SUMPRODUCT(($AM$49:$AM$52=AM49)*($AP$49:$AP$52>AP49))","v":0},{"$f":"RANK(AM49,$AM$49:$AM$52)","v":1},"Tyskland",{"$f":"SUMIF($X$49:$X$54,$AL49,$Y$49:$Y$54)+SUMIF($AB$49:$AB$54,$AL49,$AC$49:$AC$54)","v":0},{"$f":"SUMIF($X$49:$X$54,$AL49,$Z$49:$Z$54)+SUMIF($AB$49:$AB$54,$AL49,$AD$49:$AD$54)","v":0},{"$f":"SUMIF($X$49:$X$54,$AL49,$AA$49:$AA$54)+SUMIF($AB$49:$AB$54,$AL49,$AE$49:$AE$54)","v":0},{"$f":"AN49-AO49","v":0},null,1,{"$f":"VLOOKUP($AR49,$AG$49:$AP$52,6,FALSE)","v":"Tyskland"},{"$f":"VLOOKUP($AS49,$AL$49:$AP$52,2,FALSE)","v":0},{"$f":"VLOOKUP($AS49,$AL$49:$AP$52,3,FALSE)","v":0},{"$f":"VLOOKUP($AS49,$AL$49:$AP$52,4,FALSE)","v":0},{"$f":"VLOOKUP($AS49,$AL$49:$AP$52,5,FALSE)","v":0},11,"2014-06-15T19:00:00","Argentina","-","Bosnien",{"$f":"IF(G49=#REF!,2,0)","v":{"$error":"#REF!"}},"-",{"$f":"IF(I49=#REF!,2,0)","v":{"$error":"#REF!"}},{"$f":"IF(J49=#REF!,2,0)","v":{"$error":"#REF!"}},{"$f":"SUM(BC49+BE49+BF49)","v":{"$error":"#REF!"}},null,null,null,null,null,null,null,46]
[null,12,"2018-06-18","Sverige","-","Sydkorea",null,"-",null,{"$f":"IF(OR(ISBLANK(G50),ISBLANK(I50)),\"\",IF(G50>I50,1,IF(G50<I50,2,\"X\")))","v":""},2,{"$f":"VLOOKUP(K50,$AR$49:$AW$52,2,FALSE)","v":"Mexico"},{"$f":"VLOOKUP(L50,$AS$49:$AW$52,2,FALSE)","v":0},{"$f":"VLOOKUP(L50,$AS$49:$AW$52,3,FALSE)","v":0},{"$f":"VLOOKUP(L50,$AS$49:$AW$52,4,FALSE)","v":0},{"$f":"VLOOKUP(L50,$AS$49:$AW$52,5,FALSE)","v":0},null,null,null,null,null,null,null,{"$f":"D50","v":"Sverige"},0,0,0,{"$f":"F50","v":"Sydkorea"},0,0,0,null,{"$f":"RANK($AH50,$AH$49:$AH$52,1)+COUNTIF($AH$49:$AH50,$AH50)-1","v":2},{"$f":"AI50+AJ50+AK50","v":1},{"$f":"SUMPRODUCT(($AM$49:$AM$52=AM50)*($AP$49:$AP$52=AP50)*($AN$49:$AN$52>AN50))","v":0},{"$f":"SUMPRODUCT(($AM$49:$AM$52=AM50)*($AP$49:$AP$52>AP50))","v":0},{"$f":"RANK(AM50,$AM$49:$AM$52)","v":1},"Mexico",{"$f":"SUMIF($X$49:$X$54,$AL50,$Y$49:$Y$54)+SUMIF($AB$49:$AB$54,$AL50,$AC$49:$AC$54)","v":0},{"$f":"SUMIF($X$49:$X$54,$AL50,$Z$49:$Z$54)+SUMIF($AB$49:$AB$54,$AL50,$AD$49:$AD$54)","v":0},{"$f":"SUMIF($X$49:$X$54,$AL50,$AA$49:$AA$54)+SUMIF($AB$49:$AB$54,$AL50,$AE$49:$AE$54)","v":0},{"$f":"AN50-AO50","v":0},null,2,{"$f":"VLOOKUP($AR50,$AG$49:$AP$52,6,FALSE)","v":"Mexico"},{"$f":"VLOOKUP($AS50,$AL$49:$AP$52,2,FALSE)","v":0},{"$f":"VLOOKUP($AS50,$AL$49:$AP$52,3,FALSE)","v":0},{"$f":"VLOOKUP($AS50,$AL$49:$AP$52,4,FALSE)","v":0},{"$f":"VLOOKUP($AS50,$AL$49:$AP$52,5,FALSE)","v":0},12,"2014-06-16T16:00:00","Iran","-","Nigeria",{"$f":"IF(G50=#REF!,2,0)","v":{"$error":"#REF!"}},"-",{"$f":"IF(I50=#REF!,2,0)","v":{"$error":"#REF!"}},{"$f":"IF(J50=#REF!,2,0)","v":{"$error":"#REF!"}},{"$error":"#REF!"},null,null,null,null,null,null,null,47]
[null,28,"2018-06-23","Sydkorea","-","Mexico",null,"-",null,"",3,{"$f":"VLOOKUP(K51,$AR$49:$AW$52,2,FALSE)","v":"Sverige"},{"$f":"VLOOKUP(L51,$AS$49:$AW$52,2,FALSE)","v":0},{"$f":"VLOOKUP(L51,$AS$49:$AW$52,3,FALSE)","v":0},{"$f":"VLOOKUP(L51,$AS$49:$AW$52,4,FALSE)","v":0},{"$f":"VLOOKUP(L51,$AS$49:$AW$52,5,FALSE)","v":0},null,null,null,null,null,null,null,"Sydkorea",0,0,0,"Mexico",0,0,0,null,{"$f":"RANK($AH51,$AH$49:$AH$52,1)+COUNTIF($AH$49:$AH51,$AH51)-1","v":3},{"$f":"AI51+AJ51+AK51","v":1},0,0,1,"Sverige",0,0,0,0,null,3,"Sverige",0,0,0,0,27,"2014-06-21T13:00:00","Argentina","-","Iran",{"$f":"IF(G51=#REF!,2,0)","v":{"$error":"#REF!"}},"-",{"$f":"IF(I51=#REF!,2,0)","v":{"$error":"#REF!"}},{"$f":"IF(J51=#REF!,2,0)","v":{"$error":"#REF!"}},{"$error":"#REF!"},null,null,null,null,null,null,null,48]
[null,27,"2018-06-23","Tyskland","-","Sverige",null,"-",null,"",4,{"$f":"VLOOKUP(K52,$AR$49:$AW$52,2,FALSE)","v":"Sydkorea"},{"$f":"VLOOKUP(L52,$AS$49:$AW$52,2,FALSE)","v":0},{"$f":"VLOOKUP(L52,$AS$49:$AW$52,3,FALSE)","v":0},{"$f":"VLOOKUP(L52,$AS$49:$AW$52,4,FALSE)","v":0},{"$f":"VLOOKUP(L52,$AS$49:$AW$52,5,FALSE)","v":0},null,null,null,null,null,null,null,"Tyskland",0,0,0,"Sverige",0,0,0,null,{"$f":"RANK($AH52,$AH$49:$AH$52,1)+COUNTIF($AH$49:$AH52,$AH52)-1","v":4},{"$f":"AI52+AJ52+AK52","v":1},0,0,1,"Sydkorea",0,0,0,0,null,4,"Sydkorea",0,0,0,0,28,"2014-06-21T18:00:00","Nigeria","-","Bosnien",{"$f":"IF(G52=#REF!,2,0)","v":{"$error":"#REF!"}},"-",{"$f":"IF(I52=#REF!,2,0)","v":{"$error":"#REF!"}},{"$f":"IF(J52=#REF!,2,0)","v":{"$error":"#REF!"}},{"$error":"#REF!"},null,null,null,null,null,null,null,49]
[null,44,"2018-06-27","Mexico","-","Sverige",null,"-",null,"",null,null,null,null,null,null,null,null,null,null,null,null,null,"Mexico",0,0,0,"Sverige",0,0,0,null,null,null,null,null,null,null,null,null,null,null,null,null,null,null,null,null,null,43,"2014-06-25T13:00:00","Nigeria","-","Argentina",{"$f":"IF(G53=#REF!,2,0)","v":{"$error":"#REF!"}},"-",{"$f":"IF(I53=#REF!,2,0)","v":{"$error":"#REF!"}},{"$f":"IF(J53=#REF!,2,0)","v":{"$error":"#REF!"}},{"$error":"#REF!"},null,null,null,null,null,null,null,50]
[null,43,"2018-06-27","Sydkorea","-","Tyskland",null,"-",null,"",null,null,null,null,null,null,null,null,null,null,null,null,null,"Sydkorea",0,0,0,"Tyskland",0,0,0,null,null,null,null,null,null,null,null,null,null,null,null,null,null,null,null,null,null,44,"2014-06-25T13:00:00","Bosnien","-","Iran",{"$f":"IF(G54=#REF!,2,0)","v":{"$error":"#REF!"}},"-",{"$f":"IF(I54=#REF!,2,0)","v":{"$error":"#REF!"}},{"$f":"IF(J54=#REF!,2,0)","v":{"$error":"#REF!"}},{"$error":"#REF!"},null,null,null,null,null,null,null,51]
[null,null,null,null,null,null,null,null,null,null,null,null,null,null,null,null,null,null,null,null,null,null,null,null,null,null,null,null,null,null,null,null,null,null,null,null,null,null,null,null,null,null,null,null,null,null,null,null,null,null,null,null,null,null,null,null,null,null,null,null,null,null,null,null,null,null,52]
[null,"Grupp G",null,null,null,null,null,null,null,null,null,null,null,null,null,null,null,null,null,null,null,null,null,null,null,null,null,null,null,null,null,null,null,null,null,null,null,null,null,null,null,null,null,null,null,null,null,null,null,"Grupp G",null,null,null,null,null,null,null,null,null,null,null,null,null,null,null,null,53]
[null,"Match","Datum","Match",null,null,"Resultat",null,null,"Tecken",null,"Grupp G","Poäng","GM","IM"," +/-",null,null,null,null,null,null,null,"Lag 1","Poäng","GM","IM","Lag 2","Poäng","GM","IM",null,"Rank ties","Rank total","Rank mål","Rank Diff","Rank Poäng","Lag","Poäng","GM","IM","Diff",null,"Rank","Lag","Poäng","GM","IM","Diff","Match","Datum","Match",null,null,"Resultat",null,null,"Tecken","Poäng",null,null,null,null,null,null,null,54]
[null,13,"2018-06-18","Belgien","-","Panama",null,"-",null,{"$f":"IF(OR(ISBLANK(G58),ISBLANK(I58)),\"\",IF(G58>I58,1,IF(G58<I58,2,\"X\")))","v":""},1,{"$f":"VLOOKUP(K58,$AR$58:$AW$61,2,FALSE)","v":"Belgien"},{"$f":"VLOOKUP(L58,$AS$58:$AW$61,2,FALSE)","v":0},{"$f":"VLOOKUP(L58,$AS$58:$AW$61,3,FALSE)","v":0},{"$f":"VLOOKUP(L58,$AS$58:$AW$61,4,FALSE)","v":0},{"$f":"VLOOKUP(L58,$AS$58:$AW$61,5,FALSE)","v":0},null,null,null,null,null,null,null,{"$f":"D58","v":"Belgien"},{"$f":"IF(G58=\"\",0,IF($G58<$I58,0,IF($G58=$I58,1,3)))","v":0},{"$f":"G58","v":0},{"$f":"I58","v":0},{"$f":"F58","v":"Panama"},{"$f":"IF(I58=\"\",0,IF(I58<G58,0,IF(I58=G58,1,3)))","v":0},{"$f":"I58","v":0},{"$f":"G58","v":0},null,{"$f":"RANK($AH58,$AH$58:$AH$61,1)+COUNTIF($AH$58:$AH58,$AH58)-1","v":1},{"$f":"AI58+AJ58+AK58","v":1},{"$f":"SUMPRODUCT(($AM$58:$AM$61=AM58)*($AP$58:$AP$61=AP58)*($AN$58:$AN$61>AN58))","v":0},{"$f":"SUMPRODUCT(($AM$58:$AM$61=AM58)*($AP$58:$AP$61>AP58))","v":0},{"$f":"RANK(AM58,$AM$58:$AM$61)","v":1},"Belgien",{"$f":"SUMIF($X$58:$X$63,$AL58,$Y$58:$Y$63)+SUMIF($AB$58:$AB$63,$AL58,$AC$58:$AC$63)","v":0},{"$f":"SUMIF($X$58:$X$63,$AL58,$Z$58:$Z$63)+SUMIF($AB$58:$AB$63,$AL58,$AD$58:$AD$63)","v":0},{"$f":"SUMIF($X$58:$X$63,$AL58,$AA$58:$AA$63)+SUMIF($AB$58:$AB$63,$AL58,$AE$58:$AE$63)","v":0},{"$f":"AN58-AO58","v":0},null,1,{"$f":"VLOOKUP($AR58,$AG$58:$AP$61,6,FALSE)","v":"Belgien"},{"$f":"VLOOKUP($AS58,$AL$58:$AP$61,2,FALSE)","v":0},{"$f":"VLOOKUP($AS58,$AL$58:$AP$61,3,FALSE)","v":0},{"$f":"VLOOKUP($AS58,$AL$58:$AP$61,4,FALSE)","v":0},{"$f":"VLOOKUP($AS58,$AL$58:$AP$61,5,FALSE)","v":0},13,"2014-06-16T13:00:00","Tyskland","-","Portugal",{"$f":"IF(G58=#REF!,2,0)","v":{"$error":"#REF!"}},"-",{"$f":"IF(I58=#REF!,2,0)","v":{"$error":"#REF!"}},{"$f":"IF(J58=#REF!,2,0)","v":{"$error":"#REF!"}},{"$f":"SUM(BC58+BE58+BF58)","v":{"$error":"#REF!"}},null,null,null,null,null,null,null,55]
[null,14,"2018-06-18","Tunisien","-","England",null,"-",null,{"$f":"IF(OR(ISBLANK(G59),ISBLANK(I59)),\"\",IF(G59>I59,1,IF(G59<I59,2,\"X\")))","v":""},2,{"$f":"VLOOKUP(K59,$AR$58:$AW$61,2,FALSE)","v":"Panama"},{"$f":"VLOOKUP(L59,$AS$58:$AW$61,2,FALSE)","v":0},{"$f":"VLOOKUP(L59,$AS$58:$AW$61,3,FALSE)","v":0},{"$f":"VLOOKUP(L59,$AS$58:$AW$61,4,FALSE)","v":0},{"$f":"VLOOKUP(L59,$AS$58:$AW$61,5,FALSE)","v":0},null,null,null,null,null,null,null,{"$f":"D59","v":"Tunisien"},0,0,0,{"$f":"F59","v":"England"},0,0,0,null,{"$f":"RANK($AH59,$AH$58:$AH$61,1)+COUNTIF($AH$58:$AH59,$AH59)-1","v":2},{"$f":"AI59+AJ59+AK59","v":1},{"$f":"SUMPRODUCT(($AM$58:$AM$61=AM59)*($AP$58:$AP$61=AP59)*($AN$58:$AN$61>AN59))","v":0},{"$f":"SUMPRODUCT(($AM$58:$AM$61=AM59)*($AP$58:$AP$61>AP59))","v":0},{"$f":"RANK(AM59,$AM$58:$AM$61)","v":1},"Panama",{"$f":"SUMIF($X$58:$X$63,$AL59,$Y$58:$Y$63)+SUMIF($AB$58:$AB$63,$AL59,$AC$58:$AC$63)","v":0},{"$f":"SUMIF($X$58:$X$63,$AL59,$Z$58:$Z$63)+SUMIF($AB$58:$AB$63,$AL59,$AD$58:$AD$63)","v":0},{"$f":"SUMIF($X$58:$X$63,$AL59,$AA$58:$AA$63)+SUMIF($AB$58:$AB$63,$AL59,$AE$58:$AE$63)","v":0},{"$f":"AN59-AO59","v":0},null,2,{"$f":"VLOOKUP($AR59,$AG$58:$AP$61,6,FALSE)","v":"Panama"},{"$f":"VLOOKUP($AS59,$AL$58:$AP$61,2,FALSE)","v":0},{"$f":"VLOOKUP($AS59,$AL$58:$AP$61,3,FALSE)","v":0},{"$f":"VLOOKUP($AS59,$AL$58:$AP$61,4,FALSE)","v":0},{"$f":"VLOOKUP($AS59,$AL$58:$AP$61,5,FALSE)","v":0},14,"2014-06-16T19:00:00","Ghana","-","USA",{"$f":"IF(G59=#REF!,2,0)","v":{"$error":"#REF!"}},"-",{"$f":"IF(I59=#REF!,2,0)","v":{"$error":"#REF!"}},{"$f":"IF(J59=#REF!,2,0)","v":{"$error":"#REF!"}},{"$error":"#REF!"},null,null,null,null,null,null,null,56]
[null,29,"2018-06-23","Belgien","-","Tunisien",null,"-",null,"",3,{"$f":"VLOOKUP(K60,$AR$58:$AW$61,2,FALSE)","v":"Tunisien"},{"$f":"VLOOKUP(L60,$AS$58:$AW$61,2,FALSE)","v":0},{"$f":"VLOOKUP(L60,$AS$58:$AW$61,3,FALSE)","v":0},{"$f":"VLOOKUP(L60,$AS$58:$AW$61,4,FALSE)","v":0},{"$f":"VLOOKUP(L60,$AS$58:$AW$61,5,FALSE)","v":0},null,null,null,null,null,null,null,"Belgien",0,0,0,"Tunisien",0,0,0,null,{"$f":"RANK($AH60,$AH$58:$AH$61,1)+COUNTIF($AH$58:$AH60,$AH60)-1","v":3},{"$f":"AI60+AJ60+AK60","v":1},0,0,1,"Tunisien",0,0,0,0,null,3,"Tunisien",0,0,0,0,29,"2014-06-21T16:00:00","Tyskland","-","Ghana",{"$f":"IF(G60=#REF!,2,0)","v":{"$error":"#REF!"}},"-",{"$f":"IF(I60=#REF!,2,0)","v":{"$error":"#REF!"}},{"$f":"IF(J60=#REF!,2,0)","v":{"$error":"#REF!"}},{"$error":"#REF!"},null,null,null,null,null,null,null,57]
[null,30,"2018-06-24","England","-","Panama",null,"-",null,"",4,{"$f":"VLOOKUP(K61,$AR$58:$AW$61,2,FALSE)","v":"England"},{"$f":"VLOOKUP(L61,$AS$58:$AW$61,2,FALSE)","v":0},{"$f":"VLOOKUP(L61,$AS$58:$AW$61,3,FALSE)","v":0},{"$f":"VLOOKUP(L61,$AS$58:$AW$61,4,FALSE)","v":0},{"$f":"VLOOKUP(L61,$AS$58:$AW$61,5,FALSE)","v":0},null,null,null,null,null,null,null,"England",0,0,0,"Panama",0,0,0,null,{"$f":"RANK($AH61,$AH$58:$AH$61,1)+COUNTIF($AH$58:$AH61,$AH61)-1","v":4},{"$f":"AI61+AJ61+AK61","v":1},0,0,1,"England",0,0,0,0,null,4,"England",0,0,0,0,30,"2014-06-22T18:00:00","USA","-","Portugal",{"$f":"IF(G61=#REF!,2,0)","v":{"$error":"#REF!"}},"-",{"$f":"IF(I61=#REF!,2,0)","v":{"$error":"#REF!"}},{"$f":"IF(J61=#REF!,2,0)","v":{"$error":"#REF!"}},{"$error":"#REF!"},null,null,null,null,null,null,null,58]
[null,46,"2018-06-28","Panama","-","Tunisien",null,"-",null,"",null,null,null,null,null,null,null,null,null,null,null,null,null,"Panama",0,0,0,"Tunisien",0,0,0,null,null,null,null,null,null,null,null,null,null,null,null,null,null,null,null,null,null,45,"2014-06-26T13:00:00","USA","-","Tyskland",{"$f":"IF(G62=#REF!,2,0)","v":{"$error":"#REF!"}},"-",{"$f":"IF(I62=#REF!,2,0)","v":{"$error":"#REF!"}},{"$f":"IF(J62=#REF!,2,0)","v":{"$error":"#REF!"}},{"$error":"#REF!"},null,null,null,null,null,null,null,59]
[null,45,"2018-06-28","England","-","Belgien",null,"-",null,"",null,null,null,null,null,null,null,null,null,null,null,null,null,"England",0,0,0,"Belgien",0,0,0,null,null,null,null,null,null,null,null,null,null,null,null,null,null,null,null,null,null,46,"2014-06-26T13:00:00","Portugal","-","Ghana",{"$f":"IF(G63=#REF!,2,0)","v":{"$error":"#REF!"}},"-",{"$f":"IF(I63=#REF!,2,0)","v":{"$error":"#REF!"}},{"$f":"IF(J63=#REF!,2,0)","v":{"$error":"#REF!"}},{"$error":"#REF!"},null,null,null,null,null,null,null,60]
[null,null,null,null,null,null,null,null,null,null,null,null,null,null,null,null,null,null,null,null,null,null,null,null,null,null,null,null,null,null,null,null,null,null,null,null,null,null,null,null,null,null,null,null,null,null,null,null,null,null,null,null,null,null,null,null,null,null,null,null,null,null,null,null,null,null,61]
[null,"Grupp H",null,null,null,null,null,null,null,null,null,null,null,null,null,null,null,null,null,null,null,null,null,null,null,null,null,null,null,null,null,null,null,null,null,null,null,null,null,null,null,null,null,null,null,null,null,null,null,"Grupp H",null,null,null,null,null,null,null,null,null,null,null,null,null,null,null,null,62]
[null,"Match","Datum","Match",null,null,"Resultat",null,null,"Tecken",null,"Grupp H","Poäng","GM","IM"," +/-",null,null,null,null,null,null,null,"Lag 1","Poäng","GM","IM","Lag 2","Poäng","GM","IM",null,"Rank ties","Rank total","Rank mål","Rank Diff","Rank Poäng","Lag","Poäng","GM","IM","Diff",null,"Rank","Lag","Poäng","GM","IM","Diff","Match","Datum","Match",null,null,"Resultat",null,null,"Tecken","Poäng",null,null,null,null,null,null,null,63]
[null,16,"2018-06-19","Colombia","-","Japan",null,"-",null,{"$f":"IF(OR(ISBLANK(G67),ISBLANK(I67)),\"\",IF(G67>I67,1,IF(G67<I67,2,\"X\")))","v":""},1,{"$f":"VLOOKUP(K67,$AR$67:$AW$70,2,FALSE)","v":"Polen"},{"$f":"VLOOKUP(L67,$AS$67:$AW$70,2,FALSE)","v":0},{"$f":"VLOOKUP(L67,$AS$67:$AW$70,3,FALSE)","v":0},{"$f":"VLOOKUP(L67,$AS$67:$AW$70,4,FALSE)","v":0},{"$f":"VLOOKUP(L67,$AS$67:$AW$70,5,FALSE)","v":0},null,null,null,null,null,null,null,{"$f":"D67","v":"Colombia"},{"$f":"IF(G67=\"\",0,IF($G67<$I67,0,IF($G67=$I67,1,3)))","v":0},{"$f":"G67","v":0},{"$f":"I67","v":0},{"$f":"F67","v":"Japan"},{"$f":"IF(I67=\"\",0,IF(I67<G67,0,IF(I67=G67,1,3)))","v":0},{"$f":"I67","v":0},{"$f":"G67","v":0},null,{"$f":"RANK($AH67,$AH$67:$AH$70,1)+COUNTIF($AH$67:$AH67,$AH67)-1","v":1},{"$f":"AI67+AJ67+AK67","v":1},{"$f":"SUMPRODUCT(($AM$67:$AM$70=AM67)*($AP$67:$AP$70=AP67)*($AN$67:$AN$70>AN67))","v":0},{"$f":"SUMPRODUCT(($AM$67:$AM$70=AM67)*($AP$67:$AP$70>AP67))","v":0},{"$f":"RANK(AM67,$AM$67:$AM$70)","v":1},"Polen",{"$f":"SUMIF($X$67:$X$72,$AL67,$Y$67:$Y$72)+SUMIF($AB$67:$AB$72,$AL67,$AC$67:$AC$72)","v":0},{"$f":"SUMIF($X$67:$X$72,$AL67,$Z$67:$Z$72)+SUMIF($AB$67:$AB$72,$AL67,$AD$67:$AD$72)","v":0},{"$f":"SUMIF($X$67:$X$72,$AL67,$AA$67:$AA$72)+SUMIF($AB$67:$AB$72,$AL67,$AE$67:$AE$72)","v":0},{"$f":"AN67-AO67","v":0},null,1,{"$f":"VLOOKUP($AR67,$AG$67:$AP$70,6,FALSE)","v":"Polen"},{"$f":"VLOOKUP($AS67,$AL$67:$AP$70,2,FALSE)","v":0},{"$f":"VLOOKUP($AS67,$AL$67:$AP$70,3,FALSE)","v":0},{"$f":"VLOOKUP($AS67,$AL$67:$AP$70,4,FALSE)","v":0},{"$f":"VLOOKUP($AS67,$AL$67:$AP$70,5,FALSE)","v":0},15,"2014-06-17T13:00:00","Belgien","-","Algeriet",{"$f":"IF(G67=#REF!,2,0)","v":{"$error":"#REF!"}},"-",{"$f":"IF(I67=#REF!,2,0)","v":{"$error":"#REF!"}},{"$f":"IF(J67=#REF!,2,0)","v":{"$error":"#REF!"}},{"$f":"SUM(BC67+BE67+BF67)","v":{"$error":"#REF!"}},null,null,null,null,null,null,null,64]
[null,15,"2018-06-19","Polen","-","Senegal",null,"-",null,{"$f":"IF(OR(ISBLANK(G68),ISBLANK(I68)),\"\",IF(G68>I68,1,IF(G68<I68,2,\"X\")))","v":""},2,{"$f":"VLOOKUP(K68,$AR$67:$AW$70,2,FALSE)","v":"Senegal"},{"$f":"VLOOKUP(L68,$AS$67:$AW$70,2,FALSE)","v":0},{"$f":"VLOOKUP(L68,$AS$67:$AW$70,3,FALSE)","v":0},{"$f":"VLOOKUP(L68,$AS$67:$AW$70,4,FALSE)","v":0},{"$f":"VLOOKUP(L68,$AS$67:$AW$70,5,FALSE)","v":0},null,null,null,null,null,null,null,{"$f":"D68","v":"Polen"},0,0,0,{"$f":"F68","v":"Senegal"},0,0,0,null,{"$f":"RANK($AH68,$AH$67:$AH$70,1)+COUNTIF($AH$67:$AH68,$AH68)-1","v":2},{"$f":"AI68+AJ68+AK68","v":1},{"$f":"SUMPRODUCT(($AM$67:$AM$70=AM68)*($AP$67:$AP$70=AP68)*($AN$67:$AN$70>AN68))","v":0},{"$f":"SUMPRODUCT(($AM$67:$AM$70=AM68)*($AP$67:$AP$70>AP68))","v":0},{"$f":"RANK(AM68,$AM$67:$AM$70)","v":1},"Senegal",{"$f":"SUMIF($X$67:$X$72,$AL68,$Y$67:$Y$72)+SUMIF($AB$67:$AB$72,$AL68,$AC$67:$AC$72)","v":0},{"$f":"SUMIF($X$67:$X$72,$AL68,$Z$67:$Z$72)+SUMIF($AB$67:$AB$72,$AL68,$AD$67:$AD$72)","v":0},{"$f":"SUMIF($X$67:$X$72,$AL68,$AA$67:$AA$72)+SUMIF($AB$67:$AB$72,$AL68,$AE$67:$AE$72)","v":0},{"$f":"AN68-AO68","v":0},null,2,{"$f":"VLOOKUP($AR68,$AG$67:$AP$70,6,FALSE)","v":"Senegal"},{"$f":"VLOOKUP($AS68,$AL$67:$AP$70,2,FALSE)","v":0},{"$f":"VLOOKUP($AS68,$AL$67:$AP$70,3,FALSE)","v":0},{"$f":"VLOOKUP($AS68,$AL$67:$AP$70,4,FALSE)","v":0},{"$f":"VLOOKUP($AS68,$AL$67:$AP$70,5,FALSE)","v":0},16,"2014-06-17T18:00:00","Ryssland","-","Sydkorea",{"$f":"IF(G68=#REF!,2,0)","v":{"$error":"#REF!"}},"-",{"$f":"IF(I68=#REF!,2,0)","v":{"$error":"#REF!"}},{"$f":"IF(J68=#REF!,2,0)","v":{"$error":"#REF!"}},{"$error":"#REF!"},null,null,null,null,null,null,null,65]
[null,32,"2018-06-24","Japan","-","Senegal",null,"-",null,"",3,{"$f":"VLOOKUP(K69,$AR$67:$AW$70,2,FALSE)","v":"Colombia"},{"$f":"VLOOKUP(L69,$AS$67:$AW$70,2,FALSE)","v":0},{"$f":"VLOOKUP(L69,$AS$67:$AW$70,3,FALSE)","v":0},{"$f":"VLOOKUP(L69,$AS$67:$AW$70,4,FALSE)","v":0},{"$f":"VLOOKUP(L69,$AS$67:$AW$70,5,FALSE)","v":0},null,null,null,null,null,null,null,"Japan",0,0,0,"Senegal",0,0,0,null,{"$f":"RANK($AH69,$AH$67:$AH$70,1)+COUNTIF($AH$67:$AH69,$AH69)-1","v":3},{"$f":"AI69+AJ69+AK69","v":1},0,0,1,"Colombia",0,0,0,0,null,3,"Colombia",0,0,0,0,31,"2014-06-22T13:00:00","Belgien","-","Ryssland",{"$f":"IF(G69=#REF!,2,0)","v":{"$error":"#REF!"}},"-",{"$f":"IF(I69=#REF!,2,0)","v":{"$error":"#REF!"}},{"$f":"IF(J69=#REF!,2,0)","v":{"$error":"#REF!"}},{"$error":"#REF!"},null,null,null,null,null,null,null,66]
[null,31,"2018-06-24","Polen","-","Colombia",null,"-",null,"",4,{"$f":"VLOOKUP(K70,$AR$67:$AW$70,2,FALSE)","v":"Japan"},{"$f":"VLOOKUP(L70,$AS$67:$AW$70,2,FALSE)","v":0},{"$f":"VLOOKUP(L70,$AS$67:$AW$70,3,FALSE)","v":0},{"$f":"VLOOKUP(L70,$AS$67:$AW$70,4,FALSE)","v":0},{"$f":"VLOOKUP(L70,$AS$67:$AW$70,5,FALSE)","v":0},null,null,null,null,null,null,null,"Polen",0,0,0,"Colombia",0,0,0,null,{"$f":"RANK($AH70,$AH$67:$AH$70,1)+COUNTIF($AH$67:$AH70,$AH70)-1","v":4},{"$f":"AI70+AJ70+AK70","v":1},0,0,1,"Japan",0,0,0,0,null,4,"Japan",0,0,0,0,32,"2014-06-22T16:00:00","Sydkorea","-","Algeriet",{"$f":"IF(G70=#REF!,2,0)","v":{"$error":"#REF!"}},"-",{"$f":"IF(I70=#REF!,2,0)","v":{"$error":"#REF!"}},{"$f":"IF(J70=#REF!,2,0)","v":{"$error":"#REF!"}},{"$error":"#REF!"},null,null,null,null,null,null,null,67]
[null,47,"2018-06-28","Japan","-","Polen",null,"-",null,"",null,null,null,null,null,null,null,null,null,null,null,null,null,"Japan",0,0,0,"Polen",0,0,0,null,null,null,null,null,null,null,null,null,null,null,null,null,null,null,null,null,null,47,"2014-06-26T17:00:00","Sydkorea","-","Belgien",{"$f":"IF(G71=#REF!,2,0)","v":{"$error":"#REF!"}},"-",{"$f":"IF(I71=#REF!,2,0)","v":{"$error":"#REF!"}},{"$f":"IF(J71=#REF!,2,0)","v":{"$error":"#REF!"}},{"$error":"#REF!"},null,null,null,null,null,null,null,68]
[null,48,"2018-06-28","Senegal","-","Colombia",null,"-",null,"",null,null,null,null,null,null,null,null,null,null,null,null,null,"Senegal",0,0,0,"Colombia",0,0,0,null,null,null,null,null,null,null,null,null,null,null,null,null,null,null,null,null,null,48,"2014-06-26T17:00:00","Algeriet","-","Ryssland",{"$f":"IF(G72=#REF!,2,0)","v":{"$error":"#REF!"}},"-",{"$f":"IF(I72=#REF!,2,0)","v":{"$error":"#REF!"}},{"$f":"IF(J72=#REF!,2,0)","v":{"$error":"#REF!"}},{"$error":"#REF!"},null,null,null,null,null,null,null,69]
[null,null,null,null,null,null,null,null,null,null,null,null,null,null,null,null,null,null,null,null,null,null,null,null,null,null,null,null,null,null,null,null,null,null,null,null,null,null,null,null,null,null,null,null,null,null,null,null,null,null,null,null,null,null,null,null,null,null,null,null,null,null,null,null,null,null,70]
[null,"Åttondelsfinaler",null,null,null,null,null,null,null,null,null,null,null,null,null,null,null,null,null,null,null,null,null,null,null,null,null,null,null,null,null,null,null,null,null,null,null,null,null,null,null,null,null,null,null,null,null,null,null,"Åttondelsfinaler",null,null,null,null,null,null,null,null,null,null,"Åttondelsfinaler",null,null,null,null,null,71]
[null,"Match","Datum","Match",null,null,"Resultat",null,null,"Tecken",null,"Vinnare åttondelsfinal",null,null,null,null,null,null,null,null,null,null,null,"Match",null,null,null,null,null,null,null,null,null,null,null,null,null,null,null,null,null,null,null,null,null,null,null,null,null,"Match","Datum","Match",null,null,"Resultat",null,null,"Tecken","Poäng",null,"Mitt tips","Resultat & tabell","Utfall","Utfall likare","Poäng",null,72]
[null,50,"2018-06-30",{"$f":"L22","v":"Frankrike"},"-",{"$f":"L32","v":"Island"},null,"-",null,{"$f":"IF(OR(ISBLANK(G76),ISBLANK(I76)),\"\",IF(G76>I76,1,IF(G76<I76,2,\"X\")))","v":""},null,null,null,null,null,null,null,null,null,null,null,null,null,"Vinnare grupp A",null,null,null,"Tvåa grupp B",null,null,null,null,null,null,null,null,null,null,null,null,null,null,null,null,null,null,null,null,null,49,"2014-06-28",{"$f":"D76","v":"Frankrike"},"-",{"$f":"F76","v":"Island"},{"$f":"IF(G76=#REF!,2,0)","v":{"$error":"#REF!"}},"-",{"$f":"IF(I76=#REF!,2,0)","v":{"$error":"#REF!"}},{"$f":"IF(J76=#REF!,2,0)","v":{"$error":"#REF!"}},{"$f":"SUM(BC76+BE76+BF76)","v":{"$error":"#REF!"}},null,{"$f":"AZ76","v":"Frankrike"},{"$f":"#REF!","v":{"$error":"#REF!"}},{"$f":"VLOOKUP(BI76,$BJ$76:$BJ$91,1,FALSE)","v":{"$error":"#N/A"}},{"$f":"BK76","v":{"$error":"#N/A"}},{"$f":"IFERROR(IF(BK76=BL76,5,0),0)","v":0},null,73]
[null,49,"2018-06-30",{"$f":"L4","v":"Ryssland"},"-",{"$f":"L14","v":"Spanien"},null,"-",null,"",null,null,null,null,null,null,null,null,null,null,null,null,null,"Vinnare grupp C",null,null,null,"Tvåa grupp D",null,null,null,null,null,null,null,null,null,null,null,null,null,null,null,null,null,null,null,null,null,50,"2014-06-28T17:00:00","Ryssland","-","Spanien",{"$f":"IF(G77=#REF!,2,0)","v":{"$error":"#REF!"}},"-",{"$f":"IF(I77=#REF!,2,0)","v":{"$error":"#REF!"}},{"$f":"IF(J77=#REF!,2,0)","v":{"$error":"#REF!"}},{"$error":"#REF!"},null,{"$f":"AZ77","v":"Ryssland"},{"$f":"#REF!","v":{"$error":"#REF!"}},{"$f":"VLOOKUP(BI77,$BJ$76:$BJ$91,1,FALSE)","v":{"$error":"#N/A"}},{"$f":"BK77","v":{"$error":"#N/A"}},0,null,74]
[null,51,"2018-07-01",{"$f":"L13","v":"Portugal"},"-",{"$f":"L5","v":"Saudiarabien"},null,"-",null,"",null,null,null,null,null,null,null,null,null,null,null,null,null,"Vinnare grupp B",null,null,null,"Tvåa grupp A",null,null,null,null,null,null,null,null,null,null,null,null,null,null,null,null,null,null,null,null,null,51,"2014-06-29T13:00:00","Portugal","-","Saudiarabien",{"$f":"IF(G78=#REF!,2,0)","v":{"$error":"#REF!"}},"-",{"$f":"IF(I78=#REF!,2,0)","v":{"$error":"#REF!"}},{"$f":"IF(J78=#REF!,2,0)","v":{"$error":"#REF!"}},{"$error":"#REF!"},null,"Portugal",{"$f":"#REF!","v":{"$error":"#REF!"}},{"$error":"#N/A"},{"$error":"#N/A"},0,null,75]
[null,52,"2018-07-01",{"$f":"L31","v":"Argentina"},"-",{"$f":"L23","v":"Australien"},null,"-",null,"",null,null,null,null,null,null,null,null,null,null,null,null,null,"Vinnare grupp D",null,null,null,"Tvåa grupp C",null,null,null,null,null,null,null,null,null,null,null,null,null,null,null,null,null,null,null,null,null,52,"2014-06-29T17:00:00","Argentina","-","Australien",{"$f":"IF(G79=#REF!,2,0)","v":{"$error":"#REF!"}},"-",{"$f":"IF(I79=#REF!,2,0)","v":{"$error":"#REF!"}},{"$f":"IF(J79=#REF!,2,0)","v":{"$error":"#REF!"}},{"$error":"#REF!"},null,"Argentina",{"$f":"#REF!","v":{"$error":"#REF!"}},{"$error":"#N/A"},{"$error":"#N/A"},0]
[null,53,"2018-07-02",{"$f":"L40","v":"Brasilien"},"-",{"$f":"L50","v":"Mexico"},null,"-",null,"",null,null,null,null,null,null,null,null,null,null,null,null,null,"Vinnare grupp E",null,null,null,"Tvåa grupp F",null,null,null,null,null,null,null,null,null,null,null,null,null,null,null,null,null,null,null,null,null,53,"2014-06-30T13:00:00","Brasilien","-","Mexico",{"$f":"IF(G80=#REF!,2,0)","v":{"$error":"#REF!"}},"-",{"$f":"IF(I80=#REF!,2,0)","v":{"$error":"#REF!"}},{"$f":"IF(J80=#REF!,2,0)","v":{"$error":"#REF!"}},{"$error":"#REF!"},null,"Brasilien",{"$f":"#REF!","v":{"$error":"#REF!"}},{"$error":"#N/A"},{"$error":"#N/A"},0]
[null,54,"2018-07-02",{"$f":"L58","v":"Belgien"},"-",{"$f":"L68","v":"Senegal"},null,"-",null,"",null,null,null,null,null,null,null,null,null,null,null,null,null,"Vinnare grupp G",null,null,null,"Tvåa grupp H",null,null,null,null,null,null,null,null,null,null,null,null,null,null,null,null,null,null,null,null,null,54,"2014-06-30T17:00:00","Belgien","-","Senegal",{"$f":"IF(G81=#REF!,2,0)","v":{"$error":"#REF!"}},"-",{"$f":"IF(I81=#REF!,2,0)","v":{"$error":"#REF!"}},{"$f":"IF(J81=#REF!,2,0)","v":{"$error":"#REF!"}},{"$error":"#REF!"},null,"Belgien",{"$f":"#REF!","v":{"$error":"#REF!"}},{"$error":"#N/A"},{"$error":"#N/A"},0]
[null,55,"2018-07-03",{"$f":"L49","v":"Tyskland"},"-",{"$f":"L41","v":"Schweiz"},null,"-",null,"",null,null,null,null,null,null,null,null,null,null,null,null,null,"Vinnare grupp F",null,null,null,"Tvåa grupp E",null,null,null,null,null,null,null,null,null,null,null,null,null,null,null,null,null,null,null,null,null,55,"2014-07-01","Tyskland","-","Schweiz",{"$f":"IF(G82=#REF!,2,0)","v":{"$error":"#REF!"}},"-",{"$f":"IF(I82=#REF!,2,0)","v":{"$error":"#REF!"}},{"$f":"IF(J82=#REF!,2,0)","v":{"$error":"#REF!"}},{"$error":"#REF!"},null,"Tyskland",{"$f":"#REF!","v":{"$error":"#REF!"}},{"$error":"#N/A"},{"$error":"#N/A"},0]
[null,56,"2018-07-03",{"$f":"L67","v":"Polen"},"-",{"$f":"L59","v":"Panama"},null,"-",null,"",null,null,null,null,null,null,null,null,null,null,null,null,null,"Vinnare grupp H",null,null,null,"Tvåa grupp G",null,null,null,null,null,null,null,null,null,null,null,null,null,null,null,null,null,null,null,null,null,56,"2014-07-01","Polen","-","Panama",{"$f":"IF(G83=#REF!,2,0)","v":{"$error":"#REF!"}},"-",{"$f":"IF(I83=#REF!,2,0)","v":{"$error":"#REF!"}},{"$f":"IF(J83=#REF!,2,0)","v":{"$error":"#REF!"}},{"$error":"#REF!"},null,"Polen",{"$f":"#REF!","v":{"$error":"#REF!"}},{"$error":"#N/A"},{"$error":"#N/A"},0]
[null,null,null,null,null,null,null,null,null,null,null,null,null,null,null,null,null,null,null,null,null,null,null,null,null,null,null,null,null,null,null,null,null,null,null,null,null,null,null,null,null,null,null,null,null,null,null,null,null,null,null,null,null,null,null,null,null,null,null,null,{"$f":"BB76","v":"Island"},{"$f":"#REF!","v":{"$error":"#REF!"}},{"$error":"#N/A"},{"$error":"#N/A"},0]
[null,"Kvartsfinaler",null,null,null,null,null,null,null,null,null,null,null,null,null,null,null,null,null,null,null,null,null,null,null,null,null,null,null,null,null,null,null,null,null,null,null,null,null,null,null,null,null,null,null,null,null,null,null,"Kvartsfinaler",null,null,null,null,null,null,null,null,null,null,"Spanien",{"$f":"#REF!","v":{"$error":"#REF!"}},{"$error":"#N/A"},{"$error":"#N/A"},0]
[null,"Match","Datum","Match",null,null,"Resultat",null,null,"Tecken",null,"Vinnare kvartsfinal",null,null,null,null,null,null,null,null,null,null,null,"Match",null,null,null,null,null,null,null,null,null,null,null,null,null,null,null,null,null,null,null,null,null,null,null,null,null,"Match","Datum","Match",null,null,"Resultat",null,null,"Tecken","Poäng",null,"Saudiarabien",{"$f":"#REF!","v":{"$error":"#REF!"}},{"$error":"#N/A"},{"$error":"#N/A"},0]
[null,57,"2018-07-06",{"$f":"IF(L77=\"\",\"Vinnare match 49\",L77)","v":"Vinnare match 49"},"-",{"$f":"IF(L76=\"\",\"Vinnare match 50\",L76)","v":"Vinnare match 50"},null,"-",null,{"$f":"IF(OR(ISBLANK(G87),ISBLANK(I87)),\"\",IF(G87>I87,1,IF(G87<I87,2,\"X\")))","v":""},null,null,null,null,null,null,null,null,null,null,null,null,null,"Vinnare match 49",null,null,null,"Vinnare match 50",null,null,null,null,null,null,null,null,null,null,null,null,null,null,null,null,null,null,null,null,null,57,"2014-07-04",{"$f":"D87","v":"Vinnare match 49"},"-",{"$f":"F87","v":"Vinnare match 50"},{"$f":"IF(G87=#REF!,2,0)","v":{"$error":"#REF!"}},"-",{"$f":"IF(I87=#REF!,2,0)","v":{"$error":"#REF!"}},{"$f":"IF(J87=#REF!,2,0)","v":{"$error":"#REF!"}},{"$f":"SUM(BC87+BE87+BF87)","v":{"$error":"#REF!"}},null,"Australien",{"$f":"#REF!","v":{"$error":"#REF!"}},{"$error":"#N/A"},{"$error":"#N/A"},0]
[null,58,"2018-07-06",{"$f":"IF(L80=\"\",\"Vinnare match 53\",L80)","v":"Vinnare match 53"},"-",{"$f":"IF(L81=\"\",\"Vinnare match 54\",L81)","v":"Vinnare match 54"},null,"-",null,"",null,null,null,null,null,null,null,null,null,null,null,null,null,"Vinnare match 53",null,null,null,"Vinnare match 54",null,null,null,null,null,null,null,null,null,null,null,null,null,null,null,null,null,null,null,null,null,58,"2014-07-04",{"$f":"D88","v":"Vinnare match 53"},"-",{"$f":"F88","v":"Vinnare match 54"},{"$f":"IF(G88=#REF!,2,0)","v":{"$error":"#REF!"}},"-",{"$f":"IF(I88=#REF!,2,0)","v":{"$error":"#REF!"}},{"$f":"IF(J88=#REF!,2,0)","v":{"$error":"#REF!"}},{"$error":"#REF!"},null,"Mexico",{"$f":"#REF!","v":{"$error":"#REF!"}},{"$error":"#N/A"},{"$error":"#N/A"},0]
[null,59,"2018-07-07",{"$f":"IF(L78=\"\",\"Vinnare match 51\",L78)","v":"Vinnare match 51"},"-",{"$f":"IF(L79=\"\",\"Vinnare match 52\",L79)","v":"Vinnare match 52"},null,"-",null,"",null,null,null,null,null,null,null,null,null,null,null,null,null,"Vinnare match 51",null,null,null,"Vinnare match 52",null,null,null,null,null,null,null,null,null,null,null,null,null,null,null,null,null,null,null,null,null,59,"2014-07-05",{"$f":"D89","v":"Vinnare match 51"},"-",{"$f":"F89","v":"Vinnare match 52"},{"$f":"IF(G89=#REF!,2,0)","v":{"$error":"#REF!"}},"-",{"$f":"IF(I89=#REF!,2,0)","v":{"$error":"#REF!"}},{"$f":"IF(J89=#REF!,2,0)","v":{"$error":"#REF!"}},{"$error":"#REF!"},null,"Senegal",{"$f":"#REF!","v":{"$error":"#REF!"}},{"$error":"#N/A"},{"$error":"#N/A"},0]
[null,60,"2018-07-07",{"$f":"IF(L82=\"\",\"Vinnare match 55\",L82)","v":"Vinnare match 55"},"-",{"$f":"IF(L83=\"\",\"Vinnare match 56\",L83)","v":"Vinnare match 56"},null,"-",null,"",null,null,null,null,null,null,null,null,null,null,null,null,null,"Vinnare match 55",null,null,null,"Vinnare match 56",null,null,null,null,null,null,null,null,null,null,null,null,null,null,null,null,null,null,null,null,null,60,"2014-07-05",{"$f":"D90","v":"Vinnare match 55"},"-",{"$f":"F90","v":"Vinnare match 56"},{"$f":"IF(G90=#REF!,2,0)","v":{"$error":"#REF!"}},"-",{"$f":"IF(I90=#REF!,2,0)","v":{"$error":"#REF!"}},{"$f":"IF(J90=#REF!,2,0)","v":{"$error":"#REF!"}},{"$error":"#REF!"},null,"Schweiz",{"$f":"#REF!","v":{"$error":"#REF!"}},{"$error":"#N/A"},{"$error":"#N/A"},0]
[null,null,null,null,null,null,null,null,null,null,null,null,null,null,null,null,null,null,null,null,null,null,null,null,null,null,null,null,null,null,null,null,null,null,null,null,null,null,null,null,null,null,null,null,null,null,null,null,null,null,null,null,null,null,null,null,null,null,null,null,"Panama",{"$f":"#REF!","v":{"$error":"#REF!"}},{"$error":"#N/A"},{"$error":"#N/A"},0]
[null,"Semifinaler",null,null,null,null,null,null,null,null,null,null,null,null,null,null,null,null,null,null,null,null,null,null,null,null,null,null,null,null,null,null,null,null,null,null,null,null,null,null,null,null,null,null,null,null,null,null,null,"Semifinaler",null,null,null,null,null,null,null,null,null,null,null,null,null,"SUMMA",{"$f":"SUM(BM76:BM91)","v":0}]
[null,"Match","Datum","Match",null,null,"Resultat",null,null,"Tecken",null,"Vinnare semifinal","Förlorare",null,null,null,null,null,null,null,null,null,null,"Match",null,null,null,null,null,null,null,null,null,null,null,null,null,null,null,null,null,null,null,null,null,null,null,null,null,"Match","Datum","Match",null,null,"Resultat",null,null,"Tecken","Poäng",null,"Kvartsfinaler"]
[null,61,"2018-07-10",{"$f":"IF(L87=\"\",\"Vinnare match 57\",L87)","v":"Vinnare match 57"},"-",{"$f":"IF(L88=\"\",\"Vinnare match 58\",L88)","v":"Vinnare match 58"},null,"-",null,{"$f":"IF(OR(ISBLANK(G94),ISBLANK(I94)),\"\",IF(G94>I94,1,IF(G94<I94,2,\"X\")))","v":""},null,null,null,null,{"$f":"IF(L94=D94,F94,D94)","v":"Vinnare match 57"},null,null,null,null,null,null,null,null,"Vinnare match 57",null,null,null,"Vinnare match 58",null,null,null,null,null,null,null,null,null,null,null,null,null,null,null,null,null,null,null,null,null,61,"2014-07-08T17:00:00",{"$f":"D94","v":"Vinnare match 57"},"-",{"$f":"F94","v":"Vinnare match 58"},{"$f":"IF(G94=#REF!,2,0)","v":{"$error":"#REF!"}},"-",{"$f":"IF(I94=#REF!,2,0)","v":{"$error":"#REF!"}},{"$f":"IF(J94=#REF!,2,0)","v":{"$error":"#REF!"}},{"$f":"SUM(BC94+BE94+BF94)","v":{"$error":"#REF!"}},null,"Mitt tips","Resultat & tabell","Utfall","Utfall likare","Poäng"]
[null,62,"2018-07-11",{"$f":"IF(L89=\"\",\"Vinnare match 59\",L89)","v":"Vinnare match 59"},"-",{"$f":"IF(L90=\"\",\"Vinnare match 60\",L90)","v":"Vinnare match 60"},null,"-",null,"",null,null,null,null,{"$f":"IF(L95=D95,F95,D95)","v":"Vinnare match 59"},null,null,null,null,null,null,null,null,"Vinnare match 59",null,null,null,"Vinnare match 60",null,null,null,null,null,null,null,null,null,null,null,null,null,null,null,null,null,null,null,null,null,62,"2014-07-09T17:00:00",{"$f":"D95","v":"Vinnare match 59"},"-",{"$f":"F95","v":"Vinnare match 60"},{"$f":"IF(G95=#REF!,2,0)","v":{"$error":"#REF!"}},"-",{"$f":"IF(I95=#REF!,2,0)","v":{"$error":"#REF!"}},{"$f":"IF(J95=#REF!,2,0)","v":{"$error":"#REF!"}},{"$error":"#REF!"},null,{"$f":"D87","v":"Vinnare match 49"},{"$f":"#REF!","v":{"$error":"#REF!"}},{"$f":"VLOOKUP(BI95,$BJ$95:$BJ$102,1,FALSE)","v":{"$error":"#N/A"}},{"$f":"BK95","v":{"$error":"#N/A"}},{"$f":"IFERROR(IF(BK95=BL95,10,0),0)","v":0}]
[null,null,null,null,null,null,null,null,null,null,null,null,null,null,null,null,null,null,null,null,null,null,null,null,null,null,null,null,null,null,null,null,null,null,null,null,null,null,null,null,null,null,null,null,null,null,null,null,null,null,null,null,null,null,null,null,null,null,null,null,{"$f":"D88","v":"Vinnare match 53"},{"$f":"#REF!","v":{"$error":"#REF!"}},{"$f":"VLOOKUP(BI96,$BJ$95:$BJ$102,1,FALSE)","v":{"$error":"#N/A"}},{"$error":"#N/A"},0]
[null,"Bronsmatch",null,null,null,null,null,null,null,null,null,null,null,null,null,null,null,null,null,null,null,null,null,null,null,null,null,null,null,null,null,null,null,null,null,null,null,null,null,null,null,null,null,null,null,null,null,null,null,"Bronsmatch",null,null,null,null,null,null,null,null,null,null,{"$f":"D89","v":"Vinnare match 51"},{"$f":"#REF!","v":{"$error":"#REF!"}},{"$error":"#N/A"},{"$error":"#N/A"},0]
[null,"Match","Datum","Match",null,null,"Resultat",null,null,"Tecken",null,"Vinnare bronsmatch",null,null,null,null,null,null,null,null,null,null,null,"Match",null,null,null,null,null,null,null,null,null,null,null,null,null,null,null,null,null,null,null,null,null,null,null,null,null,"Match","Datum","Match",null,null,"Resultat",null,null,"Tecken","Poäng",null,{"$f":"D90","v":"Vinnare match 55"},{"$f":"#REF!","v":{"$error":"#REF!"}},{"$error":"#N/A"},{"$error":"#N/A"},0]
[null,63,"2018-07-14",{"$f":"IF(L94=\"\",\"Förlorare match 61\",O94)","v":"Förlorare match 61"},"-",{"$f":"IF(L95=\"\",\"Förlorare match 62\",O95)","v":"Förlorare match 62"},null,"-",null,{"$f":"IF(OR(ISBLANK(G99),ISBLANK(I99)),\"\",IF(G99>I99,1,IF(G99<I99,2,\"X\")))","v":""},null,null,null,null,null,null,null,null,null,null,null,null,null,"Förlorare match 61",null,null,null,"Förlorare match 62",null,null,null,null,null,null,null,null,null,null,null,null,null,null,null,null,null,null,null,null,null,63,"2014-07-12",{"$f":"D99","v":"Förlorare match 61"},"-",{"$f":"F99","v":"Förlorare match 62"},{"$f":"IF(G99=#REF!,2,0)","v":{"$error":"#REF!"}},"-",{"$f":"IF(I99=#REF!,2,0)","v":{"$error":"#REF!"}},{"$f":"IF(J99=#REF!,2,0)","v":{"$error":"#REF!"}},{"$f":"SUM(BC99+BE99+BF99)","v":{"$error":"#REF!"}},null,{"$f":"F87","v":"Vinnare match 50"},{"$f":"#REF!","v":{"$error":"#REF!"}},{"$error":"#N/A"},{"$error":"#N/A"},0]
[null,null,null,null,null,null,null,null,null,null,null,null,null,null,null,null,null,null,null,null,null,null,null,null,null,null,null,null,null,null,null,null,null,null,null,null,null,null,null,null,null,null,null,null,null,null,null,null,null,null,null,null,null,null,null,null,null,null,null,null,{"$f":"F88","v":"Vinnare match 54"},{"$f":"#REF!","v":{"$error":"#REF!"}},{"$error":"#N/A"},{"$error":"#N/A"},0]
[null,"Final",null,null,null,null,null,null,null,null,null,null,null,null,null,null,null,null,null,null,null,null,null,null,null,null,null,null,null,null,null,null,null,null,null,null,null,null,null,null,null,null,null,null,null,null,null,null,null,"Final",null,null,null,null,null,null,null,null,null,null,{"$f":"F89","v":"Vinnare match 52"},{"$f":"#REF!","v":{"$error":"#REF!"}},{"$error":"#N/A"},{"$error":"#N/A"},0]
[null,"Match","Datum","Match",null,null,"Resultat",null,null,"Tecken",null,"Vinnare final",null,null,null,null,null,null,null,null,null,null,null,"Match",null,null,null,null,null,null,null,null,null,null,null,null,null,null,null,null,null,null,null,null,null,null,null,null,null,"Match","Datum","Match",null,null,"Resultat",null,null,"Tecken","Poäng",null,{"$f":"F90","v":"Vinnare match 56"},{"$f":"#REF!","v":{"$error":"#REF!"}},{"$error":"#N/A"},{"$error":"#N/A"},0]
[null,64,"2018-07-15",{"$f":"IF(L94=\"\",\"Vinnare match 61\",L94)","v":"Vinnare match 61"},"-",{"$f":"IF(L95=\"\",\"Vinnare match 62\",L95)","v":"Vinnare match 62"},null,"-",null,{"$f":"IF(OR(ISBLANK(G103),ISBLANK(I103)),\"\",IF(G103>I103,1,IF(G103<I103,2,\"X\")))","v":""},null,null,null,null,null,null,null,null,null,null,null,null,null,"Vinnare match 61",null,null,null,"Vinnare match 62",null,null,null,null,null,null,null,null,null,null,null,null,null,null,null,null,null,null,null,null,null,64,"2014-07-13T16:00:00",{"$f":"D103","v":"Vinnare match 61"},"-",{"$f":"F103","v":"Vinnare match 62"},{"$f":"IF(G103=#REF!,2,0)","v":{"$error":"#REF!"}},"-",{"$f":"IF(I103=#REF!,2,0)","v":{"$error":"#REF!"}},{"$f":"IF(J103=#REF!,2,0)","v":{"$error":"#REF!"}},{"$f":"SUM(BC103+BE103+BF103)","v":{"$error":"#REF!"}},null,null,null,null,"SUMMA",{"$f":"SUM(BM95:BM102)","v":0}]
[null,null,null,null,null,null,null,null,null,null,null,null,null,null,null,null,null,null,null,null,null,null,null,null,null,null,null,null,null,null,null,null,null,null,null,null,null,null,null,null,null,null,null,null,null,null,null,null,null,null,null,null,null,null,null,null,null,null,null,null,"Semifinaler"]
[null,null,null,null,null,null,null,null,null,null,null,null,null,null,null,null,null,null,null,null,null,null,null,null,null,null,null,null,null,null,null,null,null,null,null,null,null,null,null,null,null,null,null,null,null,null,null,null,null,null,null,null,null,null,null,null,null,null,null,null,"Mitt tips","Resultat & tabell","Utfall","Utfall likare","Poäng"]
[null,null,null,null,null,null,null,null,null,null,null,null,null,null,null,null,null,null,null,null,null,null,null,null,null,null,null,null,null,null,null,null,null,null,null,null,null,null,null,null,null,null,null,null,null,null,null,null,null,null,null,null,null,null,null,null,null,null,null,null,{"$f":"D94","v":"Vinnare match 57"},{"$f":"#REF!","v":{"$error":"#REF!"}},{"$f":"VLOOKUP(BI106,$BJ$106:$BJ$109,1,FALSE)","v":{"$error":"#N/A"}},{"$f":"BK106","v":{"$error":"#N/A"}},{"$f":"IFERROR(IF(BK106=BL106,15,0),0)","v":0}]
[null,null,null,null,null,null,null,null,null,null,null,null,null,null,null,null,null,null,null,null,null,null,null,null,null,null,null,null,null,null,null,null,null,null,null,null,null,null,null,null,null,null,null,null,null,null,null,null,null,null,null,null,null,null,null,null,null,null,null,null,{"$f":"D95","v":"Vinnare match 59"},{"$f":"#REF!","v":{"$error":"#REF!"}},{"$f":"VLOOKUP(BI107,$BJ$106:$BJ$109,1,FALSE)","v":{"$error":"#N/A"}},{"$error":"#N/A"},{"$f":"IFERROR(IF(BK107=BL107,15,0),0)","v":0}]
[null,null,null,null,null,null,null,null,null,null,null,null,null,null,null,null,null,null,null,null,null,null,null,null,null,null,null,null,null,null,null,null,null,null,null,null,null,null,null,null,null,null,null,null,null,null,null,null,null,null,null,null,null,null,null,null,null,null,null,null,{"$f":"F94","v":"Vinnare match 58"},{"$f":"#REF!","v":{"$error":"#REF!"}},{"$error":"#N/A"},{"$error":"#N/A"},{"$f":"IFERROR(IF(BK108=BL108,15,0),0)","v":0}]
[null,null,null,null,null,null,null,null,null,null,null,null,null,null,null,null,null,null,null,null,null,null,null,null,null,null,null,null,null,null,null,null,null,null,null,null,null,null,null,null,null,null,null,null,null,null,null,null,null,null,null,null,null,null,null,null,null,null,null,null,{"$f":"F95","v":"Vinnare match 60"},{"$f":"#REF!","v":{"$error":"#REF!"}},{"$error":"#N/A"},{"$error":"#N/A"},{"$f":"IFERROR(IF(BK109=BL109,15,0),0)","v":0}]
[null,null,null,null,null,null,null,null,null,null,null,null,null,null,null,null,null,null,null,null,null,null,null,null,null,null,null,null,null,null,null,null,null,null,null,null,null,null,null,null,null,null,null,null,null,null,null,null,null,null,null,null,null,null,null,null,null,null,null,null,null,null,null,"SUMMA",{"$f":"SUM(BM106:BM109)","v":0}]
[null,null,null,null,null,null,null,null,null,null,null,null,null,null,null,null,null,null,null,null,null,null,null,null,null,null,null,null,null,null,null,null,null,null,null,null,null,null,null,null,null,null,null,null,null,null,null,null,null,null,null,null,null,null,null,null,null,null,null,null,"Bronsmatch"]
[null,null,null,null,null,null,null,null,null,null,null,null,null,null,null,null,null,null,null,null,null,null,null,null,null,null,null,null,null,null,null,null,null,null,null,null,null,null,null,null,null,null,null,null,null,null,null,null,null,null,null,null,null,null,null,null,null,null,null,null,"Mitt tips","Resultat & tabell","Utfall","Utfall likare","Poäng"]
[null,null,null,null,null,null,null,null,null,null,null,null,null,null,null,null,null,null,null,null,null,null,null,null,null,null,null,null,null,null,null,null,null,null,null,null,null,null,null,null,null,null,null,null,null,null,null,null,null,null,null,null,null,null,null,null,null,null,null,null,{"$f":"D99","v":"Förlorare match 61"},{"$f":"#REF!","v":{"$error":"#REF!"}},{"$f":"VLOOKUP(BI113,$BJ$113:$BJ$114,1,FALSE)","v":{"$error":"#N/A"}},{"$f":"BK113","v":{"$error":"#N/A"}},{"$f":"IFERROR(IF(BK113=BL113,20,0),0)","v":0}]
[null,null,null,null,null,null,null,null,null,null,null,null,null,null,null,null,null,null,null,null,null,null,null,null,null,null,null,null,null,null,null,null,null,null,null,null,null,null,null,null,null,null,null,null,null,null,null,null,null,null,null,null,null,null,null,null,null,null,null,null,{"$f":"F99","v":"Förlorare match 62"},{"$f":"#REF!","v":{"$error":"#REF!"}},{"$f":"VLOOKUP(BI114,$BJ$113:$BJ$114,1,FALSE)","v":{"$error":"#N/A"}},{"$error":"#N/A"},{"$f":"IFERROR(IF(BK114=BL114,20,0),0)","v":0}]
[null,null,null,null,null,null,null,null,null,null,null,null,null,null,null,null,null,null,null,null,null,null,null,null,null,null,null,null,null,null,null,null,null,null,null,null,null,null,null,null,null,null,null,null,null,null,null,null,null,null,null,null,null,null,null,null,null,null,null,null,null,null,null,"SUMMA",{"$f":"SUM(BM113:BM114)","v":0}]
[null,null,null,null,null,null,null,null,null,null,null,null,null,null,null,null,null,null,null,null,null,null,null,null,null,null,null,null,null,null,null,null,null,null,null,null,null,null,null,null,null,null,null,null,null,null,null,null,null,null,null,null,null,null,null,null,null,null,null,null,"Final"]
[null,null,null,null,null,null,null,null,null,null,null,null,null,null,null,null,null,null,null,null,null,null,null,null,null,null,null,null,null,null,null,null,null,null,null,null,null,null,null,null,null,null,null,null,null,null,null,null,null,null,null,null,null,null,null,null,null,null,null,null,"Mitt tips","Resultat & tabell","Utfall","Utfall likare","Poäng"]
[null,null,null,null,null,null,null,null,null,null,null,null,null,null,null,null,null,null,null,null,null,null,null,null,null,null,null,null,null,null,null,null,null,null,null,null,null,null,null,null,null,null,null,null,null,null,null,null,null,null,null,null,null,null,null,null,null,null,null,null,{"$f":"D103","v":"Vinnare match 61"},{"$f":"#REF!","v":{"$error":"#REF!"}},{"$f":"VLOOKUP(BI118,$BJ$118:$BJ$119,1,FALSE)","v":{"$error":"#N/A"}},{"$f":"BK118","v":{"$error":"#N/A"}},{"$f":"IFERROR(IF(BK118=BL118,20,0),0)","v":0}]
[null,null,null,null,null,null,null,null,null,null,null,null,null,null,null,null,null,null,null,null,null,null,null,null,null,null,null,null,null,null,null,null,null,null,null,null,null,null,null,null,null,null,null,null,null,null,null,null,null,null,null,null,null,null,null,null,null,null,null,null,{"$f":"F103","v":"Vinnare match 62"},{"$f":"#REF!","v":{"$error":"#REF!"}},{"$f":"VLOOKUP(BI119,$BJ$118:$BJ$119,1,FALSE)","v":{"$error":"#N/A"}},{"$error":"#N/A"},{"$f":"IFERROR(IF(BK119=BL119,20,0),0)","v":0}]
[null,null,null,null,null,null,null,null,null,null,null,null,null,null,null,null,null,null,null,null,null,null,null,null,null,null,null,null,null,null,null,null,null,null,null,null,null,null,null,null,null,null,null,null,null,null,null,null,null,null,null,null,null,null,null,null,null,null,null,null,null,null,null,"SUMMA",{"$f":"SUM(BM118:BM119)","v":0}]

{"sheet":"Mitt tips","index":2,"n_rows":120,"n_cols":68,"rows_kept":120,"cut":false,"hidden":false,"merged":[[102,15,102,18],[98,15,98,18],[101,3,101,5],[101,6,101,8],[101,15,101,18],[93,15,93,18],[97,3,97,5],[97,6,97,8],[97,15,97,18],[75,15,75,18],[85,3,85,5],[85,6,85,8],[85,15,85,18],[86,15,86,18],[92,3,92,5],[92,6,92,8],[92,15,92,18],[65,3,65,5],[65,6,65,8],[65,56,65,58],[74,3,74,5],[74,6,74,8],[74,15,74,18],[47,3,47,5],[47,6,47,8],[47,56,47,58],[56,3,56,5],[56,6,56,8],[56,56,56,58],[29,3,29,5],[29,6,29,8],[29,53,29,55],[29,56,29,58],[38,3,38,5],[38,6,38,8],[38,56,38,58],[20,3,20,5],[20,6,20,8],[20,53,20,55],[20,56,20,58],[2,3,2,5],[2,6,2,8],[2,19,2,22],[2,53,2,55],[2,56,2,58],[3,19,3,22],[4,19,4,22],[11,3,11,5],[11,6,11,8],[11,53,11,55],[11,56,11,58],[5,19,5,22]]}
[]
[null,"Grupp A",null,null,null,null,null,null,null,null,null,null,null,null,null,null,null,null,"Bonusfrågor",null,null,null,null,null,null,null,null,null,null,null,null,null,null,null,null,null,null,null,null,null,null,null,null,null,null,null,null,null,null,null,null,"Grupp A",null,null,null,null,null,null,null,null,null,null,"Bonusfrågor"]
[null,"Match","Datum","Match",null,null,"Resultat",null,null,"Tecken","Poäng",null,"Grupp A","Poäng","GM","IM"," +/-",null,"Kategori","Land eller spelare",null,null,null,"Poäng",null,"Lag 1","Poäng","GM","IM","Lag 2","Poäng","GM","IM",null,"Rank ties","Rank total","Rank mål","Rank Diff","Rank Poäng","Lag","Poäng","GM","IM","Diff",null,"Rank","Lag","Poäng","GM","IM","Diff","Match","Datum","Match",null,null,"Resultat",null,null,"Tecken","Poäng",null,"Kategori","Antal eller spelare","Poäng"]
[null,1,"2018-06-14","Ryssland","-","Saudiarabien",0,"-",0,{"$f":"IF(OR(ISBLANK(G4),ISBLANK(I4)),\"\",IF(G4>I4,1,IF(G4<I4,2,\"X\")))","v":"X"},{"$f":"IF('Resultat & tabell'!J4=\"\",0,BI4)","v":0},1,{"$f":"VLOOKUP(L4,AT4:AY7,2,FALSE)","v":"Saudiarabien"},{"$f":"VLOOKUP(M4,$AU$4:$AY$7,2,FALSE)","v":5},{"$f":"VLOOKUP(M4,$AU$4:$AY$7,3,FALSE)","v":4},{"$f":"VLOOKUP(M4,$AU$4:$AY$7,4,FALSE)","v":3},{"$f":"VLOOKUP(M4,$AU$4:$AY$7,5,FALSE)","v":1},null,"Skyttekung",null,null,null,null,{"$f":"IF(AND('Resultat & tabell'!S4>0,T4='Resultat & tabell'!S4),20,0)","v":0},null,{"$f":"D4","v":"Ryssland"},{"$f":"IF(G4=\"\",0,IF($G4<$I4,0,IF($G4=$I4,1,3)))","v":1},{"$f":"G4","v":0},{"$f":"I4","v":0},{"$f":"F4","v":"Saudiarabien"},{"$f":"IF(I4=\"\",0,IF(I4<G4,0,IF(G4=I4,1,3)))","v":1},{"$f":"I4","v":0},{"$f":"G4","v":0},null,{"$f":"RANK($AJ4,$AJ$4:$AJ$7,1)+COUNTIF($AJ$4:$AJ4,$AJ4)-1","v":2},{"$f":"AK4+AL4+AM4","v":2},{"$f":"SUMPRODUCT(($AO$4:$AO$7=AO4)*($AR$4:$AR$7=AR4)*($AP$4:$AP$7>AP4))","v":1},{"$f":"SUMPRODUCT(($AO$4:$AO$7=AO4)*($AR$4:$AR$7>AR4))","v":0},{"$f":"RANK(AO4,$AO$4:$AO$7)","v":1},"Ryssland",{"$f":"SUMIF($Z$4:$Z$9,$AN4,$AA$4:$AA$9)+SUMIF($AD$4:$AD$9,$AN4,$AE$4:$AE$9)","v":5},{"$f":"SUMIF($Z$4:$Z$9,AN4,$AB$4:$AB$9)+SUMIF($AD$4:$AD$9,AN4,$AF$4:$AF$9)","v":3},{"$f":"SUMIF($AD$4:$AD$9,AN4,$AG$4:$AG$9)+SUMIF($Z$4:$Z$9,AN4,$AC$4:$AC$9)","v":2},{"$f":"AP4-AQ4","v":1},null,1,{"$f":"VLOOKUP($AT4,$AI$4:$AR$7,6,FALSE)","v":"Saudiarabien"},{"$f":"VLOOKUP($AU4,$AN$4:$AR$7,2,FALSE)","v":5},{"$f":"VLOOKUP($AU4,$AN$4:$AR$7,3,FALSE)","v":4},{"$f":"VLOOKUP($AU4,$AN$4:$AR$7,4,FALSE)","v":3},{"$f":"VLOOKUP($AU4,$AN$4:$AR$7,5,FALSE)","v":1},1,"2014-06-13","Brasilien","-","Kroatien",{"$f":"IF(G4='Resultat & tabell'!$G4,2,0)","v":2},"-",{"$f":"IF(I4='Resultat & tabell'!$I4,2,0)","v":2},{"$f":"IF(J4='Resultat & tabell'!$J4,3,0)","v":0},{"$f":"SUM(BE4+BG4+BH4)","v":4},null,"Assistkung",null,{"$f":"IF(#REF!='Resultat & tabell'!$M4,20,0)","v":{"$error":"#REF!"}}]
[null,2,"2018-06-15","Egypten","-","Uruguay",1,"-",1,{"$f":"IF(OR(ISBLANK(G5),ISBLANK(I5)),\"\",IF(G5>I5,1,IF(G5<I5,2,\"X\")))","v":"X"},{"$f":"IF('Resultat & tabell'!J5=\"\",0,BI5)","v":0},2,{"$f":"VLOOKUP(L5,AT4:AY7,2,FALSE)","v":"Ryssland"},{"$f":"VLOOKUP(M5,$AU$4:$AY$7,2,FALSE)","v":5},{"$f":"VLOOKUP(M5,$AU$4:$AY$7,3,FALSE)","v":3},{"$f":"VLOOKUP(M5,$AU$4:$AY$7,4,FALSE)","v":2},{"$f":"VLOOKUP(M5,$AU$4:$AY$7,5,FALSE)","v":1},null,"Världsmästare",null,null,null,null,{"$f":"IF(AND('Resultat & tabell'!S5>0,T5='Resultat & tabell'!S5),20,0)","v":0},null,{"$f":"D5","v":"Egypten"},{"$f":"IF(G5=\"\",0,IF($G5<$I5,0,IF($G5=$I5,1,3)))","v":1},1,1,{"$f":"F5","v":"Uruguay"},{"$f":"IF(I5=\"\",0,IF(I5<G5,0,IF(G5=I5,1,3)))","v":1},1,1,null,{"$f":"RANK($AJ5,$AJ$4:$AJ$7,1)+COUNTIF($AJ$4:$AJ5,$AJ5)-1","v":1},{"$f":"AK5+AL5+AM5","v":1},{"$f":"SUMPRODUCT(($AO$4:$AO$7=AO5)*($AR$4:$AR$7=AR5)*($AP$4:$AP$7>AP5))","v":0},{"$f":"SUMPRODUCT(($AO$4:$AO$7=AO5)*($AR$4:$AR$7>AR5))","v":0},{"$f":"RANK(AO5,$AO$4:$AO$7)","v":1},"Saudiarabien",{"$f":"SUMIF($Z$4:$Z$9,$AN5,$AA$4:$AA$9)+SUMIF($AD$4:$AD$9,$AN5,$AE$4:$AE$9)","v":5},{"$f":"SUMIF($Z$4:$Z$9,AN5,$AB$4:$AB$9)+SUMIF($AD$4:$AD$9,AN5,$AF$4:$AF$9)","v":4},{"$f":"SUMIF($AD$4:$AD$9,AN5,$AG$4:$AG$9)+SUMIF($Z$4:$Z$9,AN5,$AC$4:$AC$9)","v":3},{"$f":"AP5-AQ5","v":1},null,2,{"$f":"VLOOKUP($AT5,$AI$4:$AR$7,6,FALSE)","v":"Ryssland"},{"$f":"VLOOKUP($AU5,$AN$4:$AR$7,2,FALSE)","v":5},3,{"$f":"VLOOKUP($AU5,$AN$4:$AR$7,4,FALSE)","v":2},{"$f":"VLOOKUP($AU5,$AN$4:$AR$7,5,FALSE)","v":1},2,"2014-06-13T13:00:00","Mexiko","-","Kamerun",{"$f":"IF(G5='Resultat & tabell'!$G5,2,0)","v":0},"-",{"$f":"IF(I5='Resultat & tabell'!$I5,2,0)","v":0},{"$f":"IF(J5='Resultat & tabell'!$J5,3,0)","v":0},{"$f":"SUM(BE5+BG5+BH5)","v":0},null,"Skyttekung",null,{"$f":"IF(T4='Resultat & tabell'!$M5,20,0)","v":20}]
[null,17,"2018-06-19","Ryssland","-","Egypten",1,"-",0,1,{"$f":"IF('Resultat & tabell'!J6=\"\",0,BI6)","v":0},3,{"$f":"VLOOKUP(L6,AT4:AY7,2,FALSE)","v":"Egypten"},{"$f":"VLOOKUP(M6,$AU$4:$AY$7,2,FALSE)","v":2},{"$f":"VLOOKUP(M6,$AU$4:$AY$7,3,FALSE)","v":4},{"$f":"VLOOKUP(M6,$AU$4:$AY$7,4,FALSE)","v":5},{"$f":"VLOOKUP(M6,$AU$4:$AY$7,5,FALSE)","v":-1},null,"Vinnare bronsmatch",null,null,null,null,{"$f":"IF(AND('Resultat & tabell'!S6>0,T6='Resultat & tabell'!S6),10,0)","v":0},null,"Ryssland",3,1,0,"Egypten",0,0,1,null,{"$f":"RANK($AJ6,$AJ$4:$AJ$7,1)+COUNTIF($AJ$4:$AJ6,$AJ6)-1","v":3},3,0,0,3,"Egypten",2,{"$f":"SUMIF($Z$4:$Z$9,AN6,$AB$4:$AB$9)+SUMIF($AD$4:$AD$9,AN6,$AF$4:$AF$9)","v":4},5,-1,null,3,"Egypten",2,4,5,-1,17,"2014-06-17T16:00:00","Brasilien","-","Mexiko",{"$f":"IF(G6='Resultat & tabell'!$G6,2,0)","v":0},"-",{"$f":"IF(I6='Resultat & tabell'!$I6,2,0)","v":2},{"$f":"IF(J6='Resultat & tabell'!$J6,3,0)","v":0},2,null,"Världsmästare",null,{"$f":"IF(T5='Resultat & tabell'!$M6,20,0)","v":20}]
[null,18,"2018-06-20","Uruguay","-","Saudiarabien",0,"-",1,2,{"$f":"IF('Resultat & tabell'!J7=\"\",0,BI7)","v":0},4,{"$f":"VLOOKUP(L7,AT4:AY7,2,FALSE)","v":"Uruguay"},{"$f":"VLOOKUP(M7,$AU$4:$AY$7,2,FALSE)","v":2},{"$f":"VLOOKUP(M7,$AU$4:$AY$7,3,FALSE)","v":3},{"$f":"VLOOKUP(M7,$AU$4:$AY$7,4,FALSE)","v":4},{"$f":"VLOOKUP(M7,$AU$4:$AY$7,5,FALSE)","v":-1},null,null,null,null,null,null,null,null,"Uruguay",0,0,1,"Saudiarabien",3,1,0,null,{"$f":"RANK($AJ7,$AJ$4:$AJ$7,1)+COUNTIF($AJ$4:$AJ7,$AJ7)-1","v":4},4,1,0,3,"Uruguay",2,{"$f":"SUMIF($Z$4:$Z$9,AN7,$AB$4:$AB$9)+SUMIF($AD$4:$AD$9,AN7,$AF$4:$AF$9)","v":3},4,-1,null,4,"Uruguay",2,3,4,-1,18,"2014-06-18T18:00:00","Kamerun","-","Kroatien",{"$f":"IF(G7='Resultat & tabell'!$G7,2,0)","v":2},"-",{"$f":"IF(I7='Resultat & tabell'!$I7,2,0)","v":0},{"$f":"IF(J7='Resultat & tabell'!$J7,3,0)","v":0},2]
[null,33,"2018-06-25","Uruguay","-","Ryssland",2,"-",2,"X",{"$f":"IF('Resultat & tabell'!J8=\"\",0,BI8)","v":0},null,null,null,null,null,null,null,null,null,null,null,null,null,null,"Uruguay",1,2,2,"Ryssland",1,2,2,null,null,null,null,null,null,null,null,null,null,null,null,null,null,null,null,null,null,33,"2014-06-23T17:00:00","Kamerun","-","Brasilien",{"$f":"IF(G8='Resultat & tabell'!$G8,2,0)","v":0},"-",{"$f":"IF(I8='Resultat & tabell'!$I8,2,0)","v":0},{"$f":"IF(J8='Resultat & tabell'!$J8,3,0)","v":0},0]
[null,34,"2018-06-25","Saudiarabien","-","Egypten",3,"-",3,"X",{"$f":"IF('Resultat & tabell'!J9=\"\",0,BI9)","v":0},null,null,null,null,null,null,null,null,null,null,null,null,null,null,"Saudiarabien",1,3,3,"Egypten",1,3,3,null,null,null,null,null,null,null,null,null,null,null,null,null,null,null,null,null,null,34,"2014-06-23T17:00:00","Kroatien","-","Mexiko",{"$f":"IF(G9='Resultat & tabell'!$G9,2,0)","v":0},"-",{"$f":"IF(I9='Resultat & tabell'!$I9,2,0)","v":0},{"$f":"IF(J9='Resultat & tabell'!$J9,3,0)","v":0},0]
[]
[null,"Grupp B",null,null,null,null,null,null,null,null,null,null,null,null,null,null,null,null,"Totalpoäng",null,null,null,null,null,null,null,null,null,null,null,null,null,null,null,null,null,null,null,null,null,null,null,null,null,null,null,null,null,null,null,null,"Grupp B"]
[null,"Match","Datum","Match",null,null,"Resultat",null,null,"Tecken","Poäng",null,"Grupp B","Poäng","GM","IM"," +/-",null,"Kategori","Poäng","Bonus","Totalt",null,null,null,"Lag 1","Poäng","GM","IM","Lag 2","Poäng","GM","IM",null,"Rank ties","Rank total","Rank mål","Rank Diff","Rank Poäng","Lag","Poäng","GM","IM","Diff",null,"Rank","Lag","Poäng","GM","IM","Diff","Match","Datum","Match",null,null,"Resultat",null,null,"Tecken","Poäng"]
[null,4,"2018-06-15","Marocko","-","Iran",null,"-",null,{"$f":"IF(OR(ISBLANK(G13),ISBLANK(I13)),\"\",IF(G13>I13,1,IF(G13<I13,2,\"X\")))","v":""},{"$f":"IF('Resultat & tabell'!J13=\"\",0,BI13)","v":0},1,{"$f":"VLOOKUP(L13,AT13:AY16,2,FALSE)","v":"Portugal"},{"$f":"VLOOKUP(M13,$AU$13:$AY$16,2,FALSE)","v":0},{"$f":"VLOOKUP(M13,$AU$13:$AY$16,3,FALSE)","v":0},{"$f":"VLOOKUP(M13,$AU$13:$AY$16,4,FALSE)","v":0},{"$f":"VLOOKUP(M13,$AU$13:$AY$16,5,FALSE)","v":0},null,"Gruppspel",{"$f":"SUM(K4:K72)","v":0},0,{"$f":"SUM(T13:U13)","v":0},null,null,null,{"$f":"D13","v":"Marocko"},{"$f":"IF(G13=\"\",0,IF($G13<$I13,0,IF($G13=$I13,1,3)))","v":0},{"$f":"G13","v":0},{"$f":"I13","v":0},{"$f":"F13","v":"Iran"},{"$f":"IF(I13=\"\",0,IF(I13<G13,0,IF(G13=I13,1,3)))","v":0},{"$f":"I13","v":0},{"$f":"G13","v":0},null,{"$f":"RANK($AJ13,$AJ$13:$AJ$16,1)+COUNTIF($AJ$13:$AJ13,$AJ13)-1","v":1},{"$f":"AK13+AL13+AM13","v":1},{"$f":"SUMPRODUCT(($AO$13:$AO$16=AO13)*($AR$13:$AR$16=AR13)*($AP$13:$AP$16>AP13))","v":0},{"$f":"SUMPRODUCT(($AO$13:$AO$16=AO13)*($AR$13:$AR$16>AR13))","v":0},{"$f":"RANK(AO13,$AO$13:$AO$16)","v":1},"Portugal",{"$f":"SUMIF($Z$13:$Z$18,$AN13,$AA$13:$AA$18)+SUMIF($AD$13:$AD$18,$AN13,$AE$13:$AE$18)","v":0},{"$f":"SUMIF($Z$13:$Z$18,$AN13,$AB$13:$AB$18)+SUMIF($AD$13:$AD$18,$AN13,$AF$13:$AF$18)","v":0},{"$f":"SUMIF($Z$13:$Z$18,$AN13,$AC$13:$AC$18)+SUMIF($AD$13:$AD$18,$AN13,$AG$13:$AG$18)","v":0},{"$f":"AP13-AQ13","v":0},null,1,{"$f":"VLOOKUP($AT13,$AI$13:$AR$16,6,FALSE)","v":"Portugal"},{"$f":"VLOOKUP($AU13,$AN$13:$AR$16,2,FALSE)","v":0},{"$f":"VLOOKUP($AU13,$AN$13:$AR$16,3,FALSE)","v":0},{"$f":"VLOOKUP($AU13,$AN$13:$AR$16,4,FALSE)","v":0},{"$f":"VLOOKUP($AU13,$AN$13:$AR$16,5,FALSE)","v":0},3,"2014-06-13T16:00:00","Spanien","-","Holland",{"$f":"IF(G13='Resultat & tabell'!$G13,2,0)","v":2},"-",{"$f":"IF(I13='Resultat & tabell'!$I13,2,0)","v":2},{"$f":"IF(J13='Resultat & tabell'!$J13,3,0)","v":3},{"$f":"SUM(BE13+BG13+BH13)","v":7}]
[null,3,"2018-06-15","Portugal","-","Spanien",null,"-",null,{"$f":"IF(OR(ISBLANK(G14),ISBLANK(I14)),\"\",IF(G14>I14,1,IF(G14<I14,2,\"X\")))","v":""},{"$f":"IF('Resultat & tabell'!J14=\"\",0,BI14)","v":0},2,{"$f":"VLOOKUP(L14,AT13:AY16,2,FALSE)","v":"Spanien"},{"$f":"VLOOKUP(M14,$AU$13:$AY$16,2,FALSE)","v":0},{"$f":"VLOOKUP(M14,$AU$13:$AY$16,3,FALSE)","v":0},{"$f":"VLOOKUP(M14,$AU$13:$AY$16,4,FALSE)","v":0},{"$f":"VLOOKUP(M14,$AU$13:$AY$16,5,FALSE)","v":0},null,"Åttondelsfinaler",{"$f":"SUM(K76:K83)","v":0},{"$f":"P76","v":0},0,null,null,null,{"$f":"D14","v":"Portugal"},0,0,0,{"$f":"F14","v":"Spanien"},0,0,0,null,{"$f":"RANK($AJ14,$AJ$13:$AJ$16,1)+COUNTIF($AJ$13:$AJ14,$AJ14)-1","v":2},{"$f":"AK14+AL14+AM14","v":1},{"$f":"SUMPRODUCT(($AO$13:$AO$16=AO14)*($AR$13:$AR$16=AR14)*($AP$13:$AP$16>AP14))","v":0},{"$f":"SUMPRODUCT(($AO$13:$AO$16=AO14)*($AR$13:$AR$16>AR14))","v":0},{"$f":"RANK(AO14,$AO$13:$AO$16)","v":1},"Spanien",{"$f":"SUMIF($Z$13:$Z$18,$AN14,$AA$13:$AA$18)+SUMIF($AD$13:$AD$18,$AN14,$AE$13:$AE$18)","v":0},{"$f":"SUMIF($Z$13:$Z$18,$AN14,$AB$13:$AB$18)+SUMIF($AD$13:$AD$18,AN14,$AF$13:$AF$18)","v":0},{"$f":"SUMIF($Z$13:$Z$18,$AN14,$AC$13:$AC$18)+SUMIF($AD$13:$AD$18,$AN14,$AG$13:$AG$18)","v":0},{"$f":"AP14-AQ14","v":0},null,2,{"$f":"VLOOKUP($AT14,$AI$13:$AR$16,6,FALSE)","v":"Spanien"},{"$f":"VLOOKUP($AU14,$AN$13:$AR$16,2,FALSE)","v":0},{"$f":"VLOOKUP($AU14,$AN$13:$AR$16,3,FALSE)","v":0},{"$f":"VLOOKUP($AU14,$AN$13:$AR$16,4,FALSE)","v":0},{"$f":"VLOOKUP($AU14,$AN$13:$AR$16,5,FALSE)","v":0},4,"2014-06-13T18:00:00","Chile","-","Australien",{"$f":"IF(G14='Resultat & tabell'!$G14,2,0)","v":2},"-",{"$f":"IF(I14='Resultat & tabell'!$I14,2,0)","v":2},{"$f":"IF(J14='Resultat & tabell'!$J14,3,0)","v":3},7]
[null,19,"2018-06-20","Portugal","-","Marocko",null,"-",null,"",{"$f":"IF('Resultat & tabell'!J15=\"\",0,BI15)","v":0},3,{"$f":"VLOOKUP(L15,AT13:AY16,2,FALSE)","v":"Marocko"},{"$f":"VLOOKUP(M15,$AU$13:$AY$16,2,FALSE)","v":0},{"$f":"VLOOKUP(M15,$AU$13:$AY$16,3,FALSE)","v":0},{"$f":"VLOOKUP(M15,$AU$13:$AY$16,4,FALSE)","v":0},{"$f":"VLOOKUP(M15,$AU$13:$AY$16,5,FALSE)","v":0},null,"Kvartsfinaler",{"$f":"SUM(K87:K90)","v":0},{"$f":"P87","v":0},0,null,null,null,"Portugal",0,0,0,"Marocko",0,0,0,null,{"$f":"RANK($AJ15,$AJ$13:$AJ$16,1)+COUNTIF($AJ$13:$AJ15,$AJ15)-1","v":3},{"$f":"AK15+AL15+AM15","v":1},{"$f":"SUMPRODUCT(($AO$13:$AO$16=AO15)*($AR$13:$AR$16=AR15)*($AP$13:$AP$16>AP15))","v":0},{"$f":"SUMPRODUCT(($AO$13:$AO$16=AO15)*($AR$13:$AR$16>AR15))","v":0},{"$f":"RANK(AO15,$AO$13:$AO$16)","v":1},"Marocko",{"$f":"SUMIF($Z$13:$Z$18,$AN15,$AA$13:$AA$18)+SUMIF($AD$13:$AD$18,$AN15,$AE$13:$AE$18)","v":0},{"$f":"SUMIF($Z$13:$Z$18,$AN15,$AB$13:$AB$18)+SUMIF($AD$13:$AD$18,AN15,$AF$13:$AF$18)","v":0},{"$f":"SUMIF($Z$13:$Z$18,$AN15,$AC$13:$AC$18)+SUMIF($AD$13:$AD$18,$AN15,$AG$13:$AG$18)","v":0},{"$f":"AP15-AQ15","v":0},null,3,{"$f":"VLOOKUP($AT15,$AI$13:$AR$16,6,FALSE)","v":"Marocko"},{"$f":"VLOOKUP($AU15,$AN$13:$AR$16,2,FALSE)","v":0},{"$f":"VLOOKUP($AU15,$AN$13:$AR$16,3,FALSE)","v":0},{"$f":"VLOOKUP($AU15,$AN$13:$AR$16,4,FALSE)","v":0},{"$f":"VLOOKUP($AU15,$AN$13:$AR$16,5,FALSE)","v":0},19,"2014-06-18T16:00:00","Spanien","-","Chile",{"$f":"IF(G15='Resultat & tabell'!$G15,2,0)","v":2},"-",{"$f":"IF(I15='Resultat & tabell'!$I15,2,0)","v":2},{"$f":"IF(J15='Resultat & tabell'!$J15,3,0)","v":3},7]
[null,20,"2018-06-20","Iran","-","Spanien",null,"-",null,"",{"$f":"IF('Resultat & tabell'!J16=\"\",0,BI16)","v":0},4,{"$f":"VLOOKUP(L16,AT13:AY16,2,FALSE)","v":"Iran"},{"$f":"VLOOKUP(M16,$AU$13:$AY$16,2,FALSE)","v":0},{"$f":"VLOOKUP(M16,$AU$13:$AY$16,3,FALSE)","v":0},{"$f":"VLOOKUP(M16,$AU$13:$AY$16,4,FALSE)","v":0},{"$f":"VLOOKUP(M16,$AU$13:$AY$16,5,FALSE)","v":0},null,"Semifinaler",{"$f":"SUM(K94:K95)","v":0},{"$f":"P94","v":0},0,null,null,null,"Iran",0,0,0,"Spanien",0,0,0,null,{"$f":"RANK($AJ16,$AJ$13:$AJ$16,1)+COUNTIF($AJ$13:$AJ16,$AJ16)-1","v":4},{"$f":"AK16+AL16+AM16","v":1},{"$f":"SUMPRODUCT(($AO$13:$AO$16=AO16)*($AR$13:$AR$16=AR16)*($AP$13:$AP$16>AP16))","v":0},{"$f":"SUMPRODUCT(($AO$13:$AO$16=AO16)*($AR$13:$AR$16>AR16))","v":0},{"$f":"RANK(AO16,$AO$13:$AO$16)","v":1},"Iran",{"$f":"SUMIF($Z$13:$Z$18,$AN16,$AA$13:$AA$18)+SUMIF($AD$13:$AD$18,$AN16,$AE$13:$AE$18)","v":0},{"$f":"SUMIF($Z$13:$Z$18,$AN16,$AB$13:$AB$18)+SUMIF($AD$13:$AD$18,AN16,$AF$13:$AF$18)","v":0},{"$f":"SUMIF($Z$13:$Z$18,$AN16,$AC$13:$AC$18)+SUMIF($AD$13:$AD$18,$AN16,$AG$13:$AG$18)","v":0},{"$f":"AP16-AQ16","v":0},null,4,{"$f":"VLOOKUP($AT16,$AI$13:$AR$16,6,FALSE)","v":"Iran"},{"$f":"VLOOKUP($AU16,$AN$13:$AR$16,2,FALSE)","v":0},{"$f":"VLOOKUP($AU16,$AN$13:$AR$16,3,FALSE)","v":0},{"$f":"VLOOKUP($AU16,$AN$13:$AR$16,4,FALSE)","v":0},{"$f":"VLOOKUP($AU16,$AN$13:$AR$16,5,FALSE)","v":0},20,"2014-06-18T13:00:00","Australien","-","Holland",{"$f":"IF(G16='Resultat & tabell'!$G16,2,0)","v":2},"-",{"$f":"IF(I16='Resultat & tabell'!$I16,2,0)","v":2},{"$f":"IF(J16='Resultat & tabell'!$J16,3,0)","v":3},7]
[null,35,"2018-06-25","Iran","-","Portugal",null,"-",null,"",{"$f":"IF('Resultat & tabell'!J17=\"\",0,BI17)","v":0},null,null,null,null,null,null,null,"Bronsmatch",{"$f":"SUM(K99)","v":0},{"$f":"P99","v":0},0,null,null,null,"Iran",0,0,0,"Portugal",0,0,0,null,null,null,null,null,null,null,null,null,null,null,null,null,null,null,null,null,null,35,"2014-06-23T13:00:00","Australien","-","Spanien",{"$f":"IF(G17='Resultat & tabell'!$G17,2,0)","v":2},"-",{"$f":"IF(I17='Resultat & tabell'!$I17,2,0)","v":2},{"$f":"IF(J17='Resultat & tabell'!$J17,3,0)","v":3},7]
[null,36,"2018-06-25","Spanien","-","Marocko",null,"-",null,"",{"$f":"IF('Resultat & tabell'!J18=\"\",0,BI18)","v":0},null,null,null,null,null,null,null,"Final",{"$f":"SUM(K103)","v":0},{"$f":"P103","v":0},0,null,null,null,"Spanien",0,0,0,"Marocko",0,0,0,null,null,null,null,null,null,null,null,null,null,null,null,null,null,null,null,null,null,36,"2014-06-23T13:00:00","Holland","-","Chile",{"$f":"IF(G18='Resultat & tabell'!$G18,2,0)","v":2},"-",{"$f":"IF(I18='Resultat & tabell'!$I18,2,0)","v":2},{"$f":"IF(J18='Resultat & tabell'!$J18,3,0)","v":3},7]
[null,null,null,null,null,null,null,null,null,null,null,null,null,null,null,null,null,null,"Bonusfrågor",0,{"$f":"SUM(X4:X6)","v":0},{"$f":"SUM(T19:U19)","v":0}]
[null,"Grupp C",null,null,null,null,null,null,null,null,null,null,null,null,null,null,null,null,"Summa",null,null,{"$f":"SUM(V13:V19)","v":0},null,null,null,null,null,null,null,null,null,null,null,null,null,null,null,null,null,null,null,null,null,null,null,null,null,null,null,null,null,"Grupp C"]
[null,"Match","Datum","Match",null,null,"Resultat",null,null,"Tecken","Poäng",null,"Grupp C","Poäng","GM","IM"," +/-",null,null,null,null,null,null,null,null,"Lag 1","Poäng","GM","IM","Lag 2","Poäng","GM","IM",null,"Rank ties","Rank total","Rank mål","Rank Diff","Rank Poäng","Lag","Poäng","GM","IM","Diff",null,"Rank","Lag","Poäng","GM","IM","Diff","Match","Datum","Match",null,null,"Resultat",null,null,"Tecken","Poäng"]
[null,5,"2018-06-16","Frankrike","-","Australien",null,"-",null,{"$f":"IF(OR(ISBLANK(G22),ISBLANK(I22)),\"\",IF(G22>I22,1,IF(G22<I22,2,\"X\")))","v":""},{"$f":"IF('Resultat & tabell'!J22=\"\",0,BI22)","v":0},1,{"$f":"VLOOKUP(L22,AT22:AY25,2,FALSE)","v":"Frankrike"},{"$f":"VLOOKUP(M22,$AU$22:$AY$25,2,FALSE)","v":0},{"$f":"VLOOKUP(M22,$AU$22:$AY$25,3,FALSE)","v":0},{"$f":"VLOOKUP(M22,$AU$22:$AY$25,4,FALSE)","v":0},{"$f":"VLOOKUP(M22,$AU$22:$AY$25,5,FALSE)","v":0},null,null,null,null,null,null,null,null,{"$f":"D22","v":"Frankrike"},{"$f":"IF(G22=\"\",0,IF($G22<$I22,0,IF($G22=$I22,1,3)))","v":0},{"$f":"G22","v":0},{"$f":"I22","v":0},{"$f":"F22","v":"Australien"},{"$f":"IF(I22=\"\",0,IF(I22<G22,0,IF(G22=I22,1,3)))","v":0},{"$f":"I22","v":0},{"$f":"G22","v":0},null,{"$f":"RANK($AJ22,$AJ$22:$AJ$25,1)+COUNTIF($AJ$22:$AJ22,$AJ22)-1","v":1},{"$f":"AK22+AL22+AM22","v":1},{"$f":"SUMPRODUCT(($AO$22:$AO$25=AO22)*($AR$22:$AR$25=AR22)*($AP$22:$AP$25>AP22))","v":0},{"$f":"SUMPRODUCT(($AO$22:$AO$25=AO22)*($AR$22:$AR$25>AR22))","v":0},{"$f":"RANK(AO22,$AO$22:$AO$25)","v":1},"Frankrike",{"$f":"SUMIF($Z$22:$Z$27,$AN22,$AA$22:$AA$27)+SUMIF($AD$22:$AD$27,$AN22,$AE$22:$AE$27)","v":0},{"$f":"SUMIF($Z$22:$Z$27,$AN22,$AB$22:$AB$27)+SUMIF($AD$22:$AD$27,$AN22,$AF$22:$AF$27)","v":0},{"$f":"SUMIF($Z$22:$Z$27,$AN22,$AC$22:$AC$27)+SUMIF($AD$22:$AD$27,$AN22,$AG$22:$AG$27)","v":0},{"$f":"AP22-AQ22","v":0},null,1,{"$f":"VLOOKUP($AT22,$AI$22:$AR$25,6,FALSE)","v":"Frankrike"},{"$f":"VLOOKUP($AU22,$AN$22:$AR$25,2,FALSE)","v":0},{"$f":"VLOOKUP($AU22,$AN$22:$AR$25,3,FALSE)","v":0},{"$f":"VLOOKUP($AU22,$AN$22:$AR$25,4,FALSE)","v":0},{"$f":"VLOOKUP($AU22,$AN$22:$AR$25,5,FALSE)","v":0},5,"2014-06-14T13:00:00","Colombia","-","Grekland",{"$f":"IF(G22='Resultat & tabell'!$G22,2,0)","v":2},"-",{"$f":"IF(I22='Resultat & tabell'!$I22,2,0)","v":2},{"$f":"IF(J22='Resultat & tabell'!$J22,3,0)","v":3},{"$f":"SUM(BE22+BG22+BH22)","v":7}]
[null,6,"2018-06-16","Peru","-","Danmark",null,"-",null,{"$f":"IF(OR(ISBLANK(G23),ISBLANK(I23)),\"\",IF(G23>I23,1,IF(G23<I23,2,\"X\")))","v":""},{"$f":"IF('Resultat & tabell'!J23=\"\",0,BI23)","v":0},2,{"$f":"VLOOKUP(L23,AT22:AY25,2,FALSE)","v":"Australien"},{"$f":"VLOOKUP(M23,$AU$22:$AY$25,2,FALSE)","v":0},{"$f":"VLOOKUP(M23,$AU$22:$AY$25,3,FALSE)","v":0},{"$f":"VLOOKUP(M23,$AU$22:$AY$25,4,FALSE)","v":0},{"$f":"VLOOKUP(M23,$AU$22:$AY$25,5,FALSE)","v":0},null,null,null,null,null,null,null,null,{"$f":"D23","v":"Peru"},0,0,0,{"$f":"F23","v":"Danmark"},0,0,0,null,{"$f":"RANK($AJ23,$AJ$22:$AJ$25,1)+COUNTIF($AJ$22:$AJ23,$AJ23)-1","v":2},{"$f":"AK23+AL23+AM23","v":1},{"$f":"SUMPRODUCT(($AO$22:$AO$25=AO23)*($AR$22:$AR$25=AR23)*($AP$22:$AP$25>AP23))","v":0},{"$f":"SUMPRODUCT(($AO$22:$AO$25=AO23)*($AR$22:$AR$25>AR23))","v":0},{"$f":"RANK(AO23,$AO$22:$AO$25)","v":1},"Australien",{"$f":"SUMIF($Z$22:$Z$27,$AN23,$AA$22:$AA$27)+SUMIF($AD$22:$AD$27,$AN23,$AE$22:$AE$27)","v":0},{"$f":"SUMIF($Z$22:$Z$27,$AN23,$AB$22:$AB$27)+SUMIF($AD$22:$AD$27,$AN23,$AF$22:$AF$27)","v":0},{"$f":"SUMIF($Z$22:$Z$27,$AN23,$AC$22:$AC$27)+SUMIF($AD$22:$AD$27,$AN23,$AG$22:$AG$27)","v":0},{"$f":"AP23-AQ23","v":0},null,2,{"$f":"VLOOKUP($AT23,$AI$22:$AR$25,6,FALSE)","v":"Australien"},{"$f":"VLOOKUP($AU23,$AN$22:$AR$25,2,FALSE)","v":0},{"$f":"VLOOKUP($AU23,$AN$22:$AR$25,3,FALSE)","v":0},{"$f":"VLOOKUP($AU23,$AN$22:$AR$25,4,FALSE)","v":0},{"$f":"VLOOKUP($AU23,$AN$22:$AR$25,5,FALSE)","v":0},6,"2014-06-15","Elfenbenskusten","-","Japan",{"$f":"IF(G23='Resultat & tabell'!$G23,2,0)","v":2},"-",{"$f":"IF(I23='Resultat & tabell'!$I23,2,0)","v":2},{"$f":"IF(J23='Resultat & tabell'!$J23,3,0)","v":3},7]
[null,22,"2018-06-21","Danmark","-","Australien",null,"-",null,"",{"$f":"IF('Resultat & tabell'!J24=\"\",0,BI24)","v":0},3,{"$f":"VLOOKUP(L24,AT22:AY25,2,FALSE)","v":"Peru"},{"$f":"VLOOKUP(M24,$AU$22:$AY$25,2,FALSE)","v":0},{"$f":"VLOOKUP(M24,$AU$22:$AY$25,3,FALSE)","v":0},{"$f":"VLOOKUP(M24,$AU$22:$AY$25,4,FALSE)","v":0},{"$f":"VLOOKUP(M24,$AU$22:$AY$25,5,FALSE)","v":0},null,null,null,null,null,null,null,null,"Danmark",0,0,0,"Australien",0,0,0,null,{"$f":"RANK($AJ24,$AJ$22:$AJ$25,1)+COUNTIF($AJ$22:$AJ24,$AJ24)-1","v":3},{"$f":"AK24+AL24+AM24","v":1},0,0,1,"Peru",0,0,0,0,null,3,"Peru",0,0,0,0,21,"2014-06-19T13:00:00","Colombia","-","Elfenbenskusten",{"$f":"IF(G24='Resultat & tabell'!$G24,2,0)","v":2},"-",{"$f":"IF(I24='Resultat & tabell'!$I24,2,0)","v":2},{"$f":"IF(J24='Resultat & tabell'!$J24,3,0)","v":3},7]
[null,21,"2018-06-21","Frankrike","-","Peru",null,"-",null,"",{"$f":"IF('Resultat & tabell'!J25=\"\",0,BI25)","v":0},4,{"$f":"VLOOKUP(L25,AT22:AY25,2,FALSE)","v":"Danmark"},{"$f":"VLOOKUP(M25,$AU$22:$AY$25,2,FALSE)","v":0},{"$f":"VLOOKUP(M25,$AU$22:$AY$25,3,FALSE)","v":0},{"$f":"VLOOKUP(M25,$AU$22:$AY$25,4,FALSE)","v":0},{"$f":"VLOOKUP(M25,$AU$22:$AY$25,5,FALSE)","v":0},null,null,null,null,null,null,null,null,"Frankrike",0,0,0,"Peru",0,0,0,null,{"$f":"RANK($AJ25,$AJ$22:$AJ$25,1)+COUNTIF($AJ$22:$AJ25,$AJ25)-1","v":4},{"$f":"AK25+AL25+AM25","v":1},0,0,1,"Danmark",0,0,0,0,null,4,"Danmark",0,0,0,0,22,"2014-06-19T19:00:00","Japan","-","Grekland",{"$f":"IF(G25='Resultat & tabell'!$G25,2,0)","v":2},"-",{"$f":"IF(I25='Resultat & tabell'!$I25,2,0)","v":2},{"$f":"IF(J25='Resultat & tabell'!$J25,3,0)","v":3},7]
[null,37,"2018-06-26","Danmark","-","Frankrike",null,"-",null,"",{"$f":"IF('Resultat & tabell'!J26=\"\",0,BI26)","v":0},null,null,null,null,null,null,null,null,null,null,null,null,null,null,"Danmark",0,0,0,"Frankrike",0,0,0,null,null,null,null,null,null,null,null,null,null,null,null,null,null,null,null,null,null,37,"2014-06-24T16:00:00","Japan","-","Colombia",{"$f":"IF(G26='Resultat & tabell'!$G26,2,0)","v":2},"-",{"$f":"IF(I26='Resultat & tabell'!$I26,2,0)","v":2},{"$f":"IF(J26='Resultat & tabell'!$J26,3,0)","v":3},7]
[null,38,"2018-06-26","Australien","-","Peru",null,"-",null,"",{"$f":"IF('Resultat & tabell'!J27=\"\",0,BI27)","v":0},null,null,null,null,null,null,null,null,null,null,null,null,null,null,"Australien",0,0,0,"Peru",0,0,0,null,null,null,null,null,null,null,null,null,null,null,null,null,null,null,null,null,null,38,"2014-06-24T17:00:00","Grekland","-","Elfenbenskusten",{"$f":"IF(G27='Resultat & tabell'!$G27,2,0)","v":2},"-",{"$f":"IF(I27='Resultat & tabell'!$I27,2,0)","v":2},{"$f":"IF(J27='Resultat & tabell'!$J27,3,0)","v":3},7]
[]
[null,"Grupp D",null,null,null,null,null,null,null,null,null,null,null,null,null,null,null,null,null,null,null,null,null,null,null,null,null,null,null,null,null,null,null,null,null,null,null,null,null,null,null,null,null,null,null,null,null,null,null,null,null,"Grupp D"]
[null,"Match","Datum","Match",null,null,"Resultat",null,null,"Tecken","Poäng",null,"Grupp D","Poäng","GM","IM"," +/-",null,null,null,null,null,null,null,null,"Lag 1","Poäng","GM","IM","Lag 2","Poäng","GM","IM",null,"Rank ties","Rank total","Rank mål","Rank Diff","Rank Poäng","Lag","Poäng","GM","IM","Diff",null,"Rank","Lag","Poäng","GM","IM","Diff","Match","Datum","Match",null,null,"Resultat",null,null,"Tecken","Poäng"]
[null,7,"2018-06-16","Argentina","-","Island",null,"-",null,{"$f":"IF(OR(ISBLANK(G31),ISBLANK(I31)),\"\",IF(G31>I31,1,IF(G31<I31,2,\"X\")))","v":""},{"$f":"IF('Resultat & tabell'!J31=\"\",0,BI31)","v":0},1,{"$f":"VLOOKUP(L31,AT31:AY34,2,FALSE)","v":"Argentina"},{"$f":"VLOOKUP(M31,$AU$31:$AY$34,2,FALSE)","v":0},{"$f":"VLOOKUP(M31,$AU$31:$AY$34,3,FALSE)","v":0},{"$f":"VLOOKUP(M31,$AU$31:$AY$34,4,FALSE)","v":0},{"$f":"VLOOKUP(M31,$AU$31:$AY$34,5,FALSE)","v":0},null,null,null,null,null,null,null,null,{"$f":"D31","v":"Argentina"},{"$f":"IF(G31=\"\",0,IF($G31<$I31,0,IF($G31=$I31,1,3)))","v":0},{"$f":"G31","v":0},{"$f":"I31","v":0},{"$f":"F31","v":"Island"},{"$f":"IF(I31=\"\",0,IF(I31<G31,0,IF(G31=I31,1,3)))","v":0},{"$f":"I31","v":0},{"$f":"G31","v":0},null,{"$f":"RANK($AJ31,$AJ$31:$AJ$34,1)+COUNTIF($AJ$31:$AJ31,$AJ31)-1","v":1},{"$f":"AK31+AL31+AM31","v":1},{"$f":"SUMPRODUCT(($AO$31:$AO$34=AO31)*($AR$31:$AR$34=AR31)*($AP$31:$AP$34>AP31))","v":0},{"$f":"SUMPRODUCT(($AO$31:$AO$34=AO31)*($AR$31:$AR$34>AR31))","v":0},{"$f":"RANK(AO31,$AO$31:$AO$34)","v":1},"Argentina",{"$f":"SUMIF($Z$31:$Z$36,$AN31,$AA$31:$AA$36)+SUMIF($AD$31:$AD$36,$AN31,$AE$31:$AE$36)","v":0},{"$f":"SUMIF($Z$31:$Z$36,$AN31,$AB$31:$AB$36)+SUMIF($AD$31:$AD$36,$AN31,$AF$31:$AF$36)","v":0},{"$f":"SUMIF($Z$31:$Z$36,$AN31,$AC$31:$AC$36)+SUMIF($AD$31:$AD$36,$AN31,$AG$31:$AG$36)","v":0},{"$f":"AP31-AQ31","v":0},null,1,{"$f":"VLOOKUP($AT31,$AI$31:$AR$34,6,FALSE)","v":"Argentina"},{"$f":"VLOOKUP($AU31,$AN$31:$AR$34,2,FALSE)","v":0},{"$f":"VLOOKUP($AU31,$AN$31:$AR$34,3,FALSE)","v":0},{"$f":"VLOOKUP($AU31,$AN$31:$AR$34,4,FALSE)","v":0},{"$f":"VLOOKUP($AU31,$AN$31:$AR$34,5,FALSE)","v":0},7,"2014-06-14T16:00:00","Uruguay","-","Costa Rica",{"$f":"IF(G31='Resultat & tabell'!$G31,2,0)","v":2},"-",{"$f":"IF(I31='Resultat & tabell'!$I31,2,0)","v":2},{"$f":"IF(J31='Resultat & tabell'!$J31,3,0)","v":3},{"$f":"SUM(BE31+BG31+BH31)","v":7}]
[null,8,"2018-06-16","Kroatien","-","Nigeria",null,"-",null,{"$f":"IF(OR(ISBLANK(G32),ISBLANK(I32)),\"\",IF(G32>I32,1,IF(G32<I32,2,\"X\")))","v":""},{"$f":"IF('Resultat & tabell'!J32=\"\",0,BI32)","v":0},2,{"$f":"VLOOKUP(L32,AT31:AY34,2,FALSE)","v":"Island"},{"$f":"VLOOKUP(M32,$AU$31:$AY$34,2,FALSE)","v":0},{"$f":"VLOOKUP(M32,$AU$31:$AY$34,3,FALSE)","v":0},{"$f":"VLOOKUP(M32,$AU$31:$AY$34,4,FALSE)","v":0},{"$f":"VLOOKUP(M32,$AU$31:$AY$34,5,FALSE)","v":0},null,null,null,null,null,null,null,null,{"$f":"D32","v":"Kroatien"},0,0,0,{"$f":"F32","v":"Nigeria"},0,0,0,null,{"$f":"RANK($AJ32,$AJ$31:$AJ$34,1)+COUNTIF($AJ$31:$AJ32,$AJ32)-1","v":2},{"$f":"AK32+AL32+AM32","v":1},{"$f":"SUMPRODUCT(($AO$31:$AO$34=AO32)*($AR$31:$AR$34=AR32)*($AP$31:$AP$34>AP32))","v":0},{"$f":"SUMPRODUCT(($AO$31:$AO$34=AO32)*($AR$31:$AR$34>AR32))","v":0},{"$f":"RANK(AO32,$AO$31:$AO$34)","v":1},"Island",{"$f":"SUMIF($Z$31:$Z$36,$AN32,$AA$31:$AA$36)+SUMIF($AD$31:$AD$36,$AN32,$AE$31:$AE$36)","v":0},{"$f":"SUMIF($Z$31:$Z$36,$AN32,$AB$31:$AB$36)+SUMIF($AD$31:$AD$36,$AN32,$AF$31:$AF$36)","v":0},{"$f":"SUMIF($Z$31:$Z$36,$AN32,$AC$31:$AC$36)+SUMIF($AD$31:$AD$36,$AN32,$AG$31:$AG$36)","v":0},{"$f":"AP32-AQ32","v":0},null,2,{"$f":"VLOOKUP($AT32,$AI$31:$AR$34,6,FALSE)","v":"Island"},{"$f":"VLOOKUP($AU32,$AN$31:$AR$34,2,FALSE)","v":0},{"$f":"VLOOKUP($AU32,$AN$31:$AR$34,3,FALSE)","v":0},{"$f":"VLOOKUP($AU32,$AN$31:$AR$34,4,FALSE)","v":0},{"$f":"VLOOKUP($AU32,$AN$31:$AR$34,5,FALSE)","v":0},8,"2014-06-14T18:00:00","England","-","Italien",{"$f":"IF(G32='Resultat & tabell'!$G32,2,0)","v":2},"-",{"$f":"IF(I32='Resultat & tabell'!$I32,2,0)","v":2},{"$f":"IF(J32='Resultat & tabell'!$J32,3,0)","v":3},7]
[null,23,"2018-06-21","Argentina","-","Kroatien",null,"-",null,"",{"$f":"IF('Resultat & tabell'!J33=\"\",0,BI33)","v":0},3,{"$f":"VLOOKUP(L33,AT31:AY34,2,FALSE)","v":"Kroatien"},{"$f":"VLOOKUP(M33,$AU$31:$AY$34,2,FALSE)","v":0},{"$f":"VLOOKUP(M33,$AU$31:$AY$34,3,FALSE)","v":0},{"$f":"VLOOKUP(M33,$AU$31:$AY$34,4,FALSE)","v":0},{"$f":"VLOOKUP(M33,$AU$31:$AY$34,5,FALSE)","v":0},null,null,null,null,null,null,null,null,"Argentina",0,0,0,"Kroatien",0,0,0,null,{"$f":"RANK($AJ33,$AJ$31:$AJ$34,1)+COUNTIF($AJ$31:$AJ33,$AJ33)-1","v":3},{"$f":"AK33+AL33+AM33","v":1},0,0,1,"Kroatien",0,0,0,0,null,3,"Kroatien",0,0,0,0,23,"2014-06-19T16:00:00","Uruguay","-","England",{"$f":"IF(G33='Resultat & tabell'!$G33,2,0)","v":2},"-",{"$f":"IF(I33='Resultat & tabell'!$I33,2,0)","v":2},{"$f":"IF(J33='Resultat & tabell'!$J33,3,0)","v":3},7]
[null,24,"2018-06-22","Nigeria","-","Island",null,"-",null,"",{"$f":"IF('Resultat & tabell'!J34=\"\",0,BI34)","v":0},4,{"$f":"VLOOKUP(L34,AT31:AY34,2,FALSE)","v":"Nigeria"},{"$f":"VLOOKUP(M34,$AU$31:$AY$34,2,FALSE)","v":0},{"$f":"VLOOKUP(M34,$AU$31:$AY$34,3,FALSE)","v":0},{"$f":"VLOOKUP(M34,$AU$31:$AY$34,4,FALSE)","v":0},{"$f":"VLOOKUP(M34,$AU$31:$AY$34,5,FALSE)","v":0},null,null,null,null,null,null,null,null,"Nigeria",0,0,0,"Island",0,0,0,null,{"$f":"RANK($AJ34,$AJ$31:$AJ$34,1)+COUNTIF($AJ$31:$AJ34,$AJ34)-1","v":4},{"$f":"AK34+AL34+AM34","v":1},0,0,1,"Nigeria",0,0,0,0,null,4,"Nigeria",0,0,0,0,24,"2014-06-20T13:00:00","Italien","-","Costa Rica",{"$f":"IF(G34='Resultat & tabell'!$G34,2,0)","v":2},"-",{"$f":"IF(I34='Resultat & tabell'!$I34,2,0)","v":2},{"$f":"IF(J34='Resultat & tabell'!$J34,3,0)","v":3},7]
[null,39,"2018-06-26","Nigeria","-","Argentina",null,"-",null,"",{"$f":"IF('Resultat & tabell'!J35=\"\",0,BI35)","v":0},null,null,null,null,null,null,null,null,null,null,null,null,null,null,"Nigeria",0,0,0,"Argentina",0,0,0,null,null,null,null,null,null,null,null,null,null,null,null,null,null,null,null,null,null,39,"2014-06-24T13:00:00","Italien","-","Uruguay",{"$f":"IF(G35='Resultat & tabell'!$G35,2,0)","v":2},"-",{"$f":"IF(I35='Resultat & tabell'!$I35,2,0)","v":2},{"$f":"IF(J35='Resultat & tabell'!$J35,3,0)","v":3},7]
[null,40,"2018-06-26","Island","-","Kroatien",null,"-",null,"",{"$f":"IF('Resultat & tabell'!J36=\"\",0,BI36)","v":0},null,null,null,null,null,null,null,null,null,null,null,null,null,null,"Island",0,0,0,"Kroatien",0,0,0,null,null,null,null,null,null,null,null,null,null,null,null,null,null,null,null,null,null,40,"2014-06-24T13:00:00","Costa Rica","-","England",{"$f":"IF(G36='Resultat & tabell'!$G36,2,0)","v":2},"-",{"$f":"IF(I36='Resultat & tabell'!$I36,2,0)","v":2},{"$f":"IF(J36='Resultat & tabell'!$J36,3,0)","v":3},7]
[]
[null,"Grupp E",null,null,null,null,null,null,null,null,null,null,null,null,null,null,null,null,null,null,null,null,null,null,null,null,null,null,null,null,null,null,null,null,null,null,null,null,null,null,null,null,null,null,null,null,null,null,null,null,null,"Grupp E"]
[null,"Match","Datum","Match",null,null,"Resultat",null,null,"Tecken","Poäng",null,"Grupp E","Poäng","GM","IM"," +/-",null,null,null,null,null,null,null,null,"Lag 1","Poäng","GM","IM","Lag 2","Poäng","GM","IM",null,"Rank ties","Rank total","Rank mål","Rank Diff","Rank Poäng","Lag","Poäng","GM","IM","Diff",null,"Rank","Lag","Poäng","GM","IM","Diff","Match","Datum","Match",null,null,"Resultat",null,null,"Tecken","Poäng"]
[null,10,"2018-06-17","Costa Rica","-","Serbien",null,"-",null,{"$f":"IF(OR(ISBLANK(G40),ISBLANK(I40)),\"\",IF(G40>I40,1,IF(G40<I40,2,\"X\")))","v":""},{"$f":"IF('Resultat & tabell'!J40=\"\",0,BI40)","v":0},1,{"$f":"VLOOKUP(L40,AT40:AY43,2,FALSE)","v":"Brasilien"},{"$f":"VLOOKUP(M40,$AU$40:$AY$43,2,FALSE)","v":0},{"$f":"VLOOKUP(M40,$AU$40:$AY$43,3,FALSE)","v":0},{"$f":"VLOOKUP(M40,$AU$40:$AY$43,4,FALSE)","v":0},{"$f":"VLOOKUP(M40,$AU$40:$AY$43,5,FALSE)","v":0},null,null,null,null,null,null,null,null,{"$f":"D40","v":"Costa Rica"},{"$f":"IF(G40=\"\",0,IF($G40<$I40,0,IF($G40=$I40,1,3)))","v":0},{"$f":"G40","v":0},{"$f":"I40","v":0},{"$f":"F40","v":"Serbien"},{"$f":"IF(I40=\"\",0,IF(I40<G40,0,IF(G40=I40,1,3)))","v":0},{"$f":"I40","v":0},{"$f":"G40","v":0},null,{"$f":"RANK($AJ40,$AJ$40:$AJ$43,1)+COUNTIF($AJ$40:$AJ40,$AJ40)-1","v":1},{"$f":"AK40+AL40+AM40","v":1},{"$f":"SUMPRODUCT(($AO$40:$AO$43=AO40)*($AR$40:$AR$43=AR40)*($AP$40:$AP$43>AP40))","v":0},{"$f":"SUMPRODUCT(($AO$40:$AO$43=AO40)*($AR$40:$AR$43>AR40))","v":0},{"$f":"RANK(AO40,$AO$40:$AO$43)","v":1},"Brasilien",{"$f":"SUMIF($Z$40:$Z$45,$AN40,$AA$40:$AA$45)+SUMIF($AD$40:$AD$45,$AN40,$AE$40:$AE$45)","v":0},{"$f":"SUMIF($Z$40:$Z$45,$AN40,$AB$40:$AB$45)+SUMIF($AD$40:$AD$45,$AN40,$AF$40:$AF$45)","v":0},{"$f":"SUMIF($Z$40:$Z$45,$AN40,$AC$40:$AC$45)+SUMIF($AD$40:$AD$45,$AN40,$AG$40:$AG$45)","v":0},{"$f":"AP40-AQ40","v":0},null,1,{"$f":"VLOOKUP($AT40,$AI$40:$AR$43,6,FALSE)","v":"Brasilien"},{"$f":"VLOOKUP($AU40,$AN$40:$AR$43,2,FALSE)","v":0},{"$f":"VLOOKUP($AU40,$AN$40:$AR$43,3,FALSE)","v":0},{"$f":"VLOOKUP($AU40,$AN$40:$AR$43,4,FALSE)","v":0},{"$f":"VLOOKUP($AU40,$AN$40:$AR$43,5,FALSE)","v":0},9,"2014-06-15T13:00:00","Schweiz","-","Ecuador",{"$f":"IF(G40='Resultat & tabell'!$G40,2,0)","v":2},"-",{"$f":"IF(I40='Resultat & tabell'!$I40,2,0)","v":2},{"$f":"IF(J40='Resultat & tabell'!$J40,3,0)","v":3},{"$f":"SUM(BE40+BG40+BH40)","v":7}]
[null,9,"2018-06-17","Brasilien","-","Schweiz",null,"-",null,{"$f":"IF(OR(ISBLANK(G41),ISBLANK(I41)),\"\",IF(G41>I41,1,IF(G41<I41,2,\"X\")))","v":""},{"$f":"IF('Resultat & tabell'!J41=\"\",0,BI41)","v":0},2,{"$f":"VLOOKUP(L41,AT40:AY43,2,FALSE)","v":"Schweiz"},{"$f":"VLOOKUP(M41,$AU$40:$AY$43,2,FALSE)","v":0},{"$f":"VLOOKUP(M41,$AU$40:$AY$43,3,FALSE)","v":0},{"$f":"VLOOKUP(M41,$AU$40:$AY$43,4,FALSE)","v":0},{"$f":"VLOOKUP(M41,$AU$40:$AY$43,5,FALSE)","v":0},null,null,null,null,null,null,null,null,{"$f":"D41","v":"Brasilien"},0,0,0,{"$f":"F41","v":"Schweiz"},0,0,0,null,{"$f":"RANK($AJ41,$AJ$40:$AJ$43,1)+COUNTIF($AJ$40:$AJ41,$AJ41)-1","v":2},{"$f":"AK41+AL41+AM41","v":1},{"$f":"SUMPRODUCT(($AO$40:$AO$43=AO41)*($AR$40:$AR$43=AR41)*($AP$40:$AP$43>AP41))","v":0},{"$f":"SUMPRODUCT(($AO$40:$AO$43=AO41)*($AR$40:$AR$43>AR41))","v":0},{"$f":"RANK(AO41,$AO$40:$AO$43)","v":1},"Schweiz",{"$f":"SUMIF($Z$40:$Z$45,$AN41,$AA$40:$AA$45)+SUMIF($AD$40:$AD$45,$AN41,$AE$40:$AE$45)","v":0},{"$f":"SUMIF($Z$40:$Z$45,$AN41,$AB$40:$AB$45)+SUMIF($AD$40:$AD$45,$AN41,$AF$40:$AF$45)","v":0},{"$f":"SUMIF($Z$40:$Z$45,$AN41,$AC$40:$AC$45)+SUMIF($AD$40:$AD$45,$AN41,$AG$40:$AG$45)","v":0},{"$f":"AP41-AQ41","v":0},null,2,{"$f":"VLOOKUP($AT41,$AI$40:$AR$43,6,FALSE)","v":"Schweiz"},{"$f":"VLOOKUP($AU41,$AN$40:$AR$43,2,FALSE)","v":0},{"$f":"VLOOKUP($AU41,$AN$40:$AR$43,3,FALSE)","v":0},{"$f":"VLOOKUP($AU41,$AN$40:$AR$43,4,FALSE)","v":0},{"$f":"VLOOKUP($AU41,$AN$40:$AR$43,5,FALSE)","v":0},10,"2014-06-15T16:00:00","Frankrike","-","Honduras",{"$f":"IF(G41='Resultat & tabell'!$G41,2,0)","v":2},"-",{"$f":"IF(I41='Resultat & tabell'!$I41,2,0)","v":2},{"$f":"IF(J41='Resultat & tabell'!$J41,3,0)","v":3},7]
[null,25,"2018-06-22","Brasilien","-","Costa Rica",null,"-",null,"",{"$f":"IF('Resultat & tabell'!J42=\"\",0,BI42)","v":0},3,{"$f":"VLOOKUP(L42,AT40:AY43,2,FALSE)","v":"Costa Rica"},{"$f":"VLOOKUP(M42,$AU$40:$AY$43,2,FALSE)","v":0},{"$f":"VLOOKUP(M42,$AU$40:$AY$43,3,FALSE)","v":0},{"$f":"VLOOKUP(M42,$AU$40:$AY$43,4,FALSE)","v":0},{"$f":"VLOOKUP(M42,$AU$40:$AY$43,5,FALSE)","v":0},null,null,null,null,null,null,null,null,"Brasilien",0,0,0,"Costa Rica",0,0,0,null,{"$f":"RANK($AJ42,$AJ$40:$AJ$43,1)+COUNTIF($AJ$40:$AJ42,$AJ42)-1","v":3},{"$f":"AK42+AL42+AM42","v":1},0,0,1,"Costa Rica",0,0,0,0,null,3,"Costa Rica",0,0,0,0,25,"2014-06-20T16:00:00","Schweiz","-","Frankrike",{"$f":"IF(G42='Resultat & tabell'!$G42,2,0)","v":2},"-",{"$f":"IF(I42='Resultat & tabell'!$I42,2,0)","v":2},{"$f":"IF(J42='Resultat & tabell'!$J42,3,0)","v":3},7]
[null,26,"2018-06-22","Serbien","-","Schweiz",null,"-",null,"",{"$f":"IF('Resultat & tabell'!J43=\"\",0,BI43)","v":0},4,{"$f":"VLOOKUP(L43,AT40:AY43,2,FALSE)","v":"Serbien"},{"$f":"VLOOKUP(M43,$AU$40:$AY$43,2,FALSE)","v":0},{"$f":"VLOOKUP(M43,$AU$40:$AY$43,3,FALSE)","v":0},{"$f":"VLOOKUP(M43,$AU$40:$AY$43,4,FALSE)","v":0},{"$f":"VLOOKUP(M43,$AU$40:$AY$43,5,FALSE)","v":0},null,null,null,null,null,null,null,null,"Serbien",0,0,0,"Schweiz",0,0,0,null,{"$f":"RANK($AJ43,$AJ$40:$AJ$43,1)+COUNTIF($AJ$40:$AJ43,$AJ43)-1","v":4},{"$f":"AK43+AL43+AM43","v":1},0,0,1,"Serbien",0,0,0,0,null,4,"Serbien",0,0,0,0,26,"2014-06-20T19:00:00","Honduras","-","Ecuador",{"$f":"IF(G43='Resultat & tabell'!$G43,2,0)","v":2},"-",{"$f":"IF(I43='Resultat & tabell'!$I43,2,0)","v":2},{"$f":"IF(J43='Resultat & tabell'!$J43,3,0)","v":3},7]
[null,41,"2018-06-27","Serbien","-","Brasilien",null,"-",null,"",{"$f":"IF('Resultat & tabell'!J44=\"\",0,BI44)","v":0},null,null,null,null,null,null,null,null,null,null,null,null,null,null,"Serbien",0,0,0,"Brasilien",0,0,0,null,null,null,null,null,null,null,null,null,null,null,null,null,null,null,null,null,null,41,"2014-06-25T16:00:00","Honduras","-","Schweiz",{"$f":"IF(G44='Resultat & tabell'!$G44,2,0)","v":2},"-",{"$f":"IF(I44='Resultat & tabell'!$I44,2,0)","v":2},{"$f":"IF(J44='Resultat & tabell'!$J44,3,0)","v":3},7]
[null,42,"2018-06-27","Schweiz","-","Costa Rica",null,"-",null,"",{"$f":"IF('Resultat & tabell'!J45=\"\",0,BI45)","v":0},null,null,null,null,null,null,null,null,null,null,null,null,null,null,"Schweiz",0,0,0,"Costa Rica",0,0,0,null,null,null,null,null,null,null,null,null,null,null,null,null,null,null,null,null,null,42,"2014-06-25T17:00:00","Ecuador","-","Frankrike",{"$f":"IF(G45='Resultat & tabell'!$G45,2,0)","v":2},"-",{"$f":"IF(I45='Resultat & tabell'!$I45,2,0)","v":2},{"$f":"IF(J45='Resultat & tabell'!$J45,3,0)","v":3},7]
[]
[null,"Grupp F",null,null,null,null,null,null,null,null,null,null,null,null,null,null,null,null,null,null,null,null,null,null,null,null,null,null,null,null,null,null,null,null,null,null,null,null,null,null,null,null,null,null,null,null,null,null,null,null,null,"Grupp F"]
[null,"Match","Datum","Match",null,null,"Resultat",null,null,"Tecken","Poäng",null,"Grupp F","Poäng","GM","IM"," +/-",null,null,null,null,null,null,null,null,"Lag 1","Poäng","GM","IM","Lag 2","Poäng","GM","IM",null,"Rank ties","Rank total","Rank mål","Rank Diff","Rank Poäng","Lag","Poäng","GM","IM","Diff",null,"Rank","Lag","Poäng","GM","IM","Diff","Match","Datum","Match",null,null,"Resultat",null,null,"Tecken","Poäng"]
[null,11,"2018-06-17","Tyskland","-","Mexico",null,"-",null,{"$f":"IF(OR(ISBLANK(G49),ISBLANK(I49)),\"\",IF(G49>I49,1,IF(G49<I49,2,\"X\")))","v":""},{"$f":"IF('Resultat & tabell'!J49=\"\",0,BI49)","v":0},1,{"$f":"VLOOKUP(L49,AT49:AY52,2,FALSE)","v":"Tyskland"},{"$f":"VLOOKUP(M49,$AU$49:$AY$52,2,FALSE)","v":0},{"$f":"VLOOKUP(M49,$AU$49:$AY$52,3,FALSE)","v":0},{"$f":"VLOOKUP(M49,$AU$49:$AY$52,4,FALSE)","v":0},{"$f":"VLOOKUP(M49,$AU$49:$AY$52,5,FALSE)","v":0},null,null,null,null,null,null,null,null,{"$f":"D49","v":"Tyskland"},{"$f":"IF(G49=\"\",0,IF($G49<$I49,0,IF($G49=$I49,1,3)))","v":0},{"$f":"G49","v":0},{"$f":"I49","v":0},{"$f":"F49","v":"Mexico"},{"$f":"IF(I49=\"\",0,IF(I49<G49,0,IF(G49=I49,1,3)))","v":0},{"$f":"I49","v":0},{"$f":"G49","v":0},null,{"$f":"RANK($AJ49,$AJ$49:$AJ$52,1)+COUNTIF($AJ$49:$AJ49,$AJ49)-1","v":1},{"$f":"AK49+AL49+AM49","v":1},{"$f":"SUMPRODUCT(($AO$49:$AO$52=AO49)*($AR$49:$AR$52=AR49)*($AP$49:$AP$52>AP49))","v":0},{"$f":"SUMPRODUCT(($AO$49:$AO$52=AO49)*($AR$49:$AR$52>AR49))","v":0},{"$f":"RANK(AO49,$AO$49:$AO$52)","v":1},"Tyskland",{"$f":"SUMIF($Z$49:$Z$54,$AN49,$AA$49:$AA$54)+SUMIF($AD$49:$AD$54,$AN49,$AE$49:$AE$54)","v":0},{"$f":"SUMIF($Z$49:$Z$54,$AN49,$AB$49:$AB$54)+SUMIF($AD$49:$AD$54,$AN49,$AF$49:$AF$54)","v":0},{"$f":"SUMIF($Z$49:$Z$54,$AN49,$AC$49:$AC$54)+SUMIF($AD$49:$AD$54,$AN49,$AG$49:$AG$54)","v":0},{"$f":"AP49-AQ49","v":0},null,1,{"$f":"VLOOKUP($AT49,$AI$49:$AR$52,6,FALSE)","v":"Tyskland"},{"$f":"VLOOKUP($AU49,$AN$49:$AR$52,2,FALSE)","v":0},{"$f":"VLOOKUP($AU49,$AN$49:$AR$52,3,FALSE)","v":0},{"$f":"VLOOKUP($AU49,$AN$49:$AR$52,4,FALSE)","v":0},{"$f":"VLOOKUP($AU49,$AN$49:$AR$52,5,FALSE)","v":0},11,"2014-06-15T19:00:00","Argentina","-","Bosnien",{"$f":"IF(G49='Resultat & tabell'!$G49,2,0)","v":2},"-",{"$f":"IF(I49='Resultat & tabell'!$I49,2,0)","v":2},{"$f":"IF(J49='Resultat & tabell'!$J49,3,0)","v":3},{"$f":"SUM(BE49+BG49+BH49)","v":7}]
[null,12,"2018-06-18","Sverige","-","Sydkorea",null,"-",null,{"$f":"IF(OR(ISBLANK(G50),ISBLANK(I50)),\"\",IF(G50>I50,1,IF(G50<I50,2,\"X\")))","v":""},{"$f":"IF('Resultat & tabell'!J50=\"\",0,BI50)","v":0},2,{"$f":"VLOOKUP(L50,AT49:AY52,2,FALSE)","v":"Mexico"},{"$f":"VLOOKUP(M50,$AU$49:$AY$52,2,FALSE)","v":0},{"$f":"VLOOKUP(M50,$AU$49:$AY$52,3,FALSE)","v":0},{"$f":"VLOOKUP(M50,$AU$49:$AY$52,4,FALSE)","v":0},{"$f":"VLOOKUP(M50,$AU$49:$AY$52,5,FALSE)","v":0},null,null,null,null,null,null,null,null,{"$f":"D50","v":"Sverige"},0,0,0,{"$f":"F50","v":"Sydkorea"},0,0,0,null,{"$f":"RANK($AJ50,$AJ$49:$AJ$52,1)+COUNTIF($AJ$49:$AJ50,$AJ50)-1","v":2},{"$f":"AK50+AL50+AM50","v":1},{"$f":"SUMPRODUCT(($AO$49:$AO$52=AO50)*($AR$49:$AR$52=AR50)*($AP$49:$AP$52>AP50))","v":0},{"$f":"SUMPRODUCT(($AO$49:$AO$52=AO50)*($AR$49:$AR$52>AR50))","v":0},{"$f":"RANK(AO50,$AO$49:$AO$52)","v":1},"Mexico",{"$f":"SUMIF($Z$49:$Z$54,$AN50,$AA$49:$AA$54)+SUMIF($AD$49:$AD$54,$AN50,$AE$49:$AE$54)","v":0},{"$f":"SUMIF($Z$49:$Z$54,$AN50,$AB$49:$AB$54)+SUMIF($AD$49:$AD$54,$AN50,$AF$49:$AF$54)","v":0},{"$f":"SUMIF($Z$49:$Z$54,$AN50,$AC$49:$AC$54)+SUMIF($AD$49:$AD$54,$AN50,$AG$49:$AG$54)","v":0},{"$f":"AP50-AQ50","v":0},null,2,{"$f":"VLOOKUP($AT50,$AI$49:$AR$52,6,FALSE)","v":"Mexico"},{"$f":"VLOOKUP($AU50,$AN$49:$AR$52,2,FALSE)","v":0},{"$f":"VLOOKUP($AU50,$AN$49:$AR$52,3,FALSE)","v":0},{"$f":"VLOOKUP($AU50,$AN$49:$AR$52,4,FALSE)","v":0},{"$f":"VLOOKUP($AU50,$AN$49:$AR$52,5,FALSE)","v":0},12,"2014-06-16T16:00:00","Iran","-","Nigeria",{"$f":"IF(G50='Resultat & tabell'!$G50,2,0)","v":2},"-",{"$f":"IF(I50='Resultat & tabell'!$I50,2,0)","v":2},{"$f":"IF(J50='Resultat & tabell'!$J50,3,0)","v":3},7]
[null,28,"2018-06-23","Sydkorea","-","Mexico",null,"-",null,"",{"$f":"IF('Resultat & tabell'!J51=\"\",0,BI51)","v":0},3,{"$f":"VLOOKUP(L51,AT49:AY52,2,FALSE)","v":"Sverige"},{"$f":"VLOOKUP(M51,$AU$49:$AY$52,2,FALSE)","v":0},{"$f":"VLOOKUP(M51,$AU$49:$AY$52,3,FALSE)","v":0},{"$f":"VLOOKUP(M51,$AU$49:$AY$52,4,FALSE)","v":0},{"$f":"VLOOKUP(M51,$AU$49:$AY$52,5,FALSE)","v":0},null,null,null,null,null,null,null,null,"Sydkorea",0,0,0,"Mexico",0,0,0,null,{"$f":"RANK($AJ51,$AJ$49:$AJ$52,1)+COUNTIF($AJ$49:$AJ51,$AJ51)-1","v":3},{"$f":"AK51+AL51+AM51","v":1},0,0,1,"Sverige",0,0,0,0,null,3,"Sverige",0,0,0,0,27,"2014-06-21T13:00:00","Argentina","-","Iran",{"$f":"IF(G51='Resultat & tabell'!$G51,2,0)","v":2},"-",{"$f":"IF(I51='Resultat & tabell'!$I51,2,0)","v":2},{"$f":"IF(J51='Resultat & tabell'!$J51,3,0)","v":3},7]
[null,27,"2018-06-23","Tyskland","-","Sverige",null,"-",null,"",{"$f":"IF('Resultat & tabell'!J52=\"\",0,BI52)","v":0},4,{"$f":"VLOOKUP(L52,AT49:AY52,2,FALSE)","v":"Sydkorea"},{"$f":"VLOOKUP(M52,$AU$49:$AY$52,2,FALSE)","v":0},{"$f":"VLOOKUP(M52,$AU$49:$AY$52,3,FALSE)","v":0},{"$f":"VLOOKUP(M52,$AU$49:$AY$52,4,FALSE)","v":0},{"$f":"VLOOKUP(M52,$AU$49:$AY$52,5,FALSE)","v":0},null,null,null,null,null,null,null,null,"Tyskland",0,0,0,"Sverige",0,0,0,null,{"$f":"RANK($AJ52,$AJ$49:$AJ$52,1)+COUNTIF($AJ$49:$AJ52,$AJ52)-1","v":4},{"$f":"AK52+AL52+AM52","v":1},0,0,1,"Sydkorea",0,0,0,0,null,4,"Sydkorea",0,0,0,0,28,"2014-06-21T18:00:00","Nigeria","-","Bosnien",{"$f":"IF(G52='Resultat & tabell'!$G52,2,0)","v":2},"-",{"$f":"IF(I52='Resultat & tabell'!$I52,2,0)","v":2},{"$f":"IF(J52='Resultat & tabell'!$J52,3,0)","v":3},7]
[null,44,"2018-06-27","Mexico","-","Sverige",null,"-",null,"",{"$f":"IF('Resultat & tabell'!J53=\"\",0,BI53)","v":0},null,null,null,null,null,null,null,null,null,null,null,null,null,null,"Mexico",0,0,0,"Sverige",0,0,0,null,null,null,null,null,null,null,null,null,null,null,null,null,null,null,null,null,null,43,"2014-06-25T13:00:00","Nigeria","-","Argentina",{"$f":"IF(G53='Resultat & tabell'!$G53,2,0)","v":2},"-",{"$f":"IF(I53='Resultat & tabell'!$I53,2,0)","v":2},{"$f":"IF(J53='Resultat & tabell'!$J53,3,0)","v":3},7]
[null,43,"2018-06-27","Sydkorea","-","Tyskland",null,"-",null,"",{"$f":"IF('Resultat & tabell'!J54=\"\",0,BI54)","v":0},null,null,null,null,null,null,null,null,null,null,null,null,null,null,"Sydkorea",0,0,0,"Tyskland",0,0,0,null,null,null,null,null,null,null,null,null,null,null,null,null,null,null,null,null,null,44,"2014-06-25T13:00:00","Bosnien","-","Iran",{"$f":"IF(G54='Resultat & tabell'!$G54,2,0)","v":2},"-",{"$f":"IF(I54='Resultat & tabell'!$I54,2,0)","v":2},{"$f":"IF(J54='Resultat & tabell'!$J54,3,0)","v":3},7]
[]
[null,"Grupp G",null,null,null,null,null,null,null,null,null,null,null,null,null,null,null,null,null,null,null,null,null,null,null,null,null,null,null,null,null,null,null,null,null,null,null,null,null,null,null,null,null,null,null,null,null,null,null,null,null,"Grupp G"]
[null,"Match","Datum","Match",null,null,"Resultat",null,null,"Tecken","Poäng",null,"Grupp G","Poäng","GM","IM"," +/-",null,null,null,null,null,null,null,null,"Lag 1","Poäng","GM","IM","Lag 2","Poäng","GM","IM",null,"Rank ties","Rank total","Rank mål","Rank Diff","Rank Poäng","Lag","Poäng","GM","IM","Diff",null,"Rank","Lag","Poäng","GM","IM","Diff","Match","Datum","Match",null,null,"Resultat",null,null,"Tecken","Poäng"]
[null,13,"2018-06-18","Belgien","-","Panama",null,"-",null,{"$f":"IF(OR(ISBLANK(G58),ISBLANK(I58)),\"\",IF(G58>I58,1,IF(G58<I58,2,\"X\")))","v":""},{"$f":"IF('Resultat & tabell'!J58=\"\",0,BI58)","v":0},1,{"$f":"VLOOKUP(L58,AT58:AY61,2,FALSE)","v":"Belgien"},{"$f":"VLOOKUP(M58,$AU$58:$AY$61,2,FALSE)","v":0},{"$f":"VLOOKUP(M58,$AU$58:$AY$61,3,FALSE)","v":0},{"$f":"VLOOKUP(M58,$AU$58:$AY$61,4,FALSE)","v":0},{"$f":"VLOOKUP(M58,$AU$58:$AY$61,5,FALSE)","v":0},null,null,null,null,null,null,null,null,{"$f":"D58","v":"Belgien"},{"$f":"IF(G58=\"\",0,IF($G58<$I58,0,IF($G58=$I58,1,3)))","v":0},{"$f":"G58","v":0},{"$f":"I58","v":0},{"$f":"F58","v":"Panama"},{"$f":"IF(I58=\"\",0,IF(I58<G58,0,IF(G58=I58,1,3)))","v":0},{"$f":"I58","v":0},{"$f":"G58","v":0},null,{"$f":"RANK($AJ58,$AJ$58:$AJ$61,1)+COUNTIF($AJ$58:$AJ58,$AJ58)-1","v":1},{"$f":"AK58+AL58+AM58","v":1},{"$f":"SUMPRODUCT(($AO$58:$AO$61=AO58)*($AR$58:$AR$61=AR58)*($AP$58:$AP$61>AP58))","v":0},{"$f":"SUMPRODUCT(($AO$58:$AO$61=AO58)*($AR$58:$AR$61>AR58))","v":0},{"$f":"RANK(AO58,$AO$58:$AO$61)","v":1},"Belgien",{"$f":"SUMIF($Z$58:$Z$63,$AN58,$AA$58:$AA$63)+SUMIF($AD$58:$AD$63,$AN58,$AE$58:$AE$63)","v":0},{"$f":"SUMIF($Z$58:$Z$63,$AN58,$AB$58:$AB$63)+SUMIF($AD$58:$AD$63,$AN58,$AF$58:$AF$63)","v":0},{"$f":"SUMIF($Z$58:$Z$63,$AN58,$AC$58:$AC$63)+SUMIF($AD$58:$AD$63,$AN58,$AG$58:$AG$63)","v":0},{"$f":"AP58-AQ58","v":0},null,1,{"$f":"VLOOKUP($AT58,$AI$58:$AR$61,6,FALSE)","v":"Belgien"},{"$f":"VLOOKUP($AU58,$AN$58:$AR$61,2,FALSE)","v":0},{"$f":"VLOOKUP($AU58,$AN$58:$AR$61,3,FALSE)","v":0},{"$f":"VLOOKUP($AU58,$AN$58:$AR$61,4,FALSE)","v":0},{"$f":"VLOOKUP($AU58,$AN$58:$AR$61,5,FALSE)","v":0},13,"2014-06-16T13:00:00","Tyskland","-","Portugal",{"$f":"IF(G58='Resultat & tabell'!$G58,2,0)","v":2},"-",{"$f":"IF(I58='Resultat & tabell'!$I58,2,0)","v":2},{"$f":"IF(J58='Resultat & tabell'!$J58,3,0)","v":3},{"$f":"SUM(BE58+BG58+BH58)","v":7}]
[null,14,"2018-06-18","Tunisien","-","England",null,"-",null,{"$f":"IF(OR(ISBLANK(G59),ISBLANK(I59)),\"\",IF(G59>I59,1,IF(G59<I59,2,\"X\")))","v":""},{"$f":"IF('Resultat & tabell'!J59=\"\",0,BI59)","v":0},2,{"$f":"VLOOKUP(L59,AT58:AY61,2,FALSE)","v":"Panama"},{"$f":"VLOOKUP(M59,$AU$58:$AY$61,2,FALSE)","v":0},{"$f":"VLOOKUP(M59,$AU$58:$AY$61,3,FALSE)","v":0},{"$f":"VLOOKUP(M59,$AU$58:$AY$61,4,FALSE)","v":0},{"$f":"VLOOKUP(M59,$AU$58:$AY$61,5,FALSE)","v":0},null,null,null,null,null,null,null,null,{"$f":"D59","v":"Tunisien"},0,0,0,{"$f":"F59","v":"England"},0,0,0,null,{"$f":"RANK($AJ59,$AJ$58:$AJ$61,1)+COUNTIF($AJ$58:$AJ59,$AJ59)-1","v":2},{"$f":"AK59+AL59+AM59","v":1},{"$f":"SUMPRODUCT(($AO$58:$AO$61=AO59)*($AR$58:$AR$61=AR59)*($AP$58:$AP$61>AP59))","v":0},{"$f":"SUMPRODUCT(($AO$58:$AO$61=AO59)*($AR$58:$AR$61>AR59))","v":0},{"$f":"RANK(AO59,$AO$58:$AO$61)","v":1},"Panama",{"$f":"SUMIF($Z$58:$Z$63,$AN59,$AA$58:$AA$63)+SUMIF($AD$58:$AD$63,$AN59,$AE$58:$AE$63)","v":0},{"$f":"SUMIF($Z$58:$Z$63,$AN59,$AB$58:$AB$63)+SUMIF($AD$58:$AD$63,$AN59,$AF$58:$AF$63)","v":0},{"$f":"SUMIF($Z$58:$Z$63,$AN59,$AC$58:$AC$63)+SUMIF($AD$58:$AD$63,$AN59,$AG$58:$AG$63)","v":0},{"$f":"AP59-AQ59","v":0},null,2,{"$f":"VLOOKUP($AT59,$AI$58:$AR$61,6,FALSE)","v":"Panama"},{"$f":"VLOOKUP($AU59,$AN$58:$AR$61,2,FALSE)","v":0},{"$f":"VLOOKUP($AU59,$AN$58:$AR$61,3,FALSE)","v":0},{"$f":"VLOOKUP($AU59,$AN$58:$AR$61,4,FALSE)","v":0},{"$f":"VLOOKUP($AU59,$AN$58:$AR$61,5,FALSE)","v":0},14,"2014-06-16T19:00:00","Ghana","-","USA",{"$f":"IF(G59='Resultat & tabell'!$G59,2,0)","v":2},"-",{"$f":"IF(I59='Resultat & tabell'!$I59,2,0)","v":2},{"$f":"IF(J59='Resultat & tabell'!$J59,3,0)","v":3},7]
[null,29,"2018-06-23","Belgien","-","Tunisien",null,"-",null,"",{"$f":"IF('Resultat & tabell'!J60=\"\",0,BI60)","v":0},3,{"$f":"VLOOKUP(L60,AT58:AY61,2,FALSE)","v":"Tunisien"},{"$f":"VLOOKUP(M60,$AU$58:$AY$61,2,FALSE)","v":0},{"$f":"VLOOKUP(M60,$AU$58:$AY$61,3,FALSE)","v":0},{"$f":"VLOOKUP(M60,$AU$58:$AY$61,4,FALSE)","v":0},{"$f":"VLOOKUP(M60,$AU$58:$AY$61,5,FALSE)","v":0},null,null,null,null,null,null,null,null,"Belgien",0,0,0,"Tunisien",0,0,0,null,{"$f":"RANK($AJ60,$AJ$58:$AJ$61,1)+COUNTIF($AJ$58:$AJ60,$AJ60)-1","v":3},{"$f":"AK60+AL60+AM60","v":1},0,0,1,"Tunisien",0,0,0,0,null,3,"Tunisien",0,0,0,0,29,"2014-06-21T16:00:00","Tyskland","-","Ghana",{"$f":"IF(G60='Resultat & tabell'!$G60,2,0)","v":2},"-",{"$f":"IF(I60='Resultat & tabell'!$I60,2,0)","v":2},{"$f":"IF(J60='Resultat & tabell'!$J60,3,0)","v":3},7]
[null,30,"2018-06-24","England","-","Panama",null,"-",null,"",{"$f":"IF('Resultat & tabell'!J61=\"\",0,BI61)","v":0},4,{"$f":"VLOOKUP(L61,AT58:AY61,2,FALSE)","v":"England"},{"$f":"VLOOKUP(M61,$AU$58:$AY$61,2,FALSE)","v":0},{"$f":"VLOOKUP(M61,$AU$58:$AY$61,3,FALSE)","v":0},{"$f":"VLOOKUP(M61,$AU$58:$AY$61,4,FALSE)","v":0},{"$f":"VLOOKUP(M61,$AU$58:$AY$61,5,FALSE)","v":0},null,null,null,null,null,null,null,null,"England",0,0,0,"Panama",0,0,0,null,{"$f":"RANK($AJ61,$AJ$58:$AJ$61,1)+COUNTIF($AJ$58:$AJ61,$AJ61)-1","v":4},{"$f":"AK61+AL61+AM61","v":1},0,0,1,"England",0,0,0,0,null,4,"England",0,0,0,0,30,"2014-06-22T18:00:00","USA","-","Portugal",{"$f":"IF(G61='Resultat & tabell'!$G61,2,0)","v":2},"-",{"$f":"IF(I61='Resultat & tabell'!$I61,2,0)","v":2},{"$f":"IF(J61='Resultat & tabell'!$J61,3,0)","v":3},7]
[null,46,"2018-06-28","Panama","-","Tunisien",null,"-",null,"",{"$f":"IF('Resultat & tabell'!J62=\"\",0,BI62)","v":0},null,null,null,null,null,null,null,null,null,null,null,null,null,null,"Panama",0,0,0,"Tunisien",0,0,0,null,null,null,null,null,null,null,null,null,null,null,null,null,null,null,null,null,null,45,"2014-06-26T13:00:00","USA","-","Tyskland",{"$f":"IF(G62='Resultat & tabell'!$G62,2,0)","v":2},"-",{"$f":"IF(I62='Resultat & tabell'!$I62,2,0)","v":2},{"$f":"IF(J62='Resultat & tabell'!$J62,3,0)","v":3},7]
[null,45,"2018-06-28","England","-","Belgien",null,"-",null,"",{"$f":"IF('Resultat & tabell'!J63=\"\",0,BI63)","v":0},null,null,null,null,null,null,null,null,null,null,null,null,null,null,"England",0,0,0,"Belgien",0,0,0,null,null,null,null,null,null,null,null,null,null,null,null,null,null,null,null,null,null,46,"2014-06-26T13:00:00","Portugal","-","Ghana",{"$f":"IF(G63='Resultat & tabell'!$G63,2,0)","v":2},"-",{"$f":"IF(I63='Resultat & tabell'!$I63,2,0)","v":2},{"$f":"IF(J63='Resultat & tabell'!$J63,3,0)","v":3},7]
[]
[null,"Grupp H",null,null,null,null,null,null,null,null,null,null,null,null,null,null,null,null,null,null,null,null,null,null,null,null,null,null,null,null,null,null,null,null,null,null,null,null,null,null,null,null,null,null,null,null,null,null,null,null,null,"Grupp H"]
[null,"Match","Datum","Match",null,null,"Resultat",null,null,"Tecken","Poäng",null,"Grupp H","Poäng","GM","IM"," +/-",null,null,null,null,null,null,null,null,"Lag 1","Poäng","GM","IM","Lag 2","Poäng","GM","IM",null,"Rank ties","Rank total","Rank mål","Rank Diff","Rank Poäng","Lag","Poäng","GM","IM","Diff",null,"Rank","Lag","Poäng","GM","IM","Diff","Match","Datum","Match",null,null,"Resultat",null,null,"Tecken","Poäng"]
[null,16,"2018-06-19","Colombia","-","Japan",null,"-",null,{"$f":"IF(OR(ISBLANK(G67),ISBLANK(I67)),\"\",IF(G67>I67,1,IF(G67<I67,2,\"X\")))","v":""},{"$f":"IF('Resultat & tabell'!J67=\"\",0,BI67)","v":0},1,{"$f":"VLOOKUP(L67,AT67:AY70,2,FALSE)","v":"Polen"},{"$f":"VLOOKUP(M67,$AU$67:$AY$70,2,FALSE)","v":0},{"$f":"VLOOKUP(M67,$AU$67:$AY$70,3,FALSE)","v":0},{"$f":"VLOOKUP(M67,$AU$67:$AY$70,4,FALSE)","v":0},{"$f":"VLOOKUP(M67,$AU$67:$AY$70,5,FALSE)","v":0},null,null,null,null,null,null,null,null,{"$f":"D67","v":"Colombia"},{"$f":"IF(G67=\"\",0,IF($G67<$I67,0,IF($G67=$I67,1,3)))","v":0},{"$f":"G67","v":0},{"$f":"I67","v":0},{"$f":"F67","v":"Japan"},{"$f":"IF(I67=\"\",0,IF(I67<G67,0,IF(G67=I67,1,3)))","v":0},{"$f":"I67","v":0},{"$f":"G67","v":0},null,{"$f":"RANK($AJ67,$AJ$67:$AJ$71,1)+COUNTIF($AJ$67:$AJ67,$AJ67)-1","v":1},{"$f":"AK67+AL67+AM67","v":1},{"$f":"SUMPRODUCT(($AO$67:$AO$70=AO67)*($AR$67:$AR$70=AR67)*($AP$67:$AP$70>AP67))","v":0},{"$f":"SUMPRODUCT(($AO$67:$AO$70=AO67)*($AR$67:$AR$70>AR67))","v":0},{"$f":"RANK(AO67,$AO$67:$AO$70)","v":1},"Polen",{"$f":"SUMIF($Z$67:$Z$72,$AN67,$AA$67:$AA$72)+SUMIF($AD$67:$AD$72,$AN67,$AE$67:$AE$72)","v":0},{"$f":"SUMIF($Z$67:$Z$72,$AN67,$AB$67:$AB$72)+SUMIF($AD$67:$AD$72,$AN67,$AF$67:$AF$72)","v":0},{"$f":"SUMIF($Z$67:$Z$72,$AN67,$AC$67:$AC$72)+SUMIF($AD$67:$AD$72,$AN67,$AG$67:$AG$72)","v":0},{"$f":"AP67-AQ67","v":0},null,1,{"$f":"VLOOKUP($AT67,$AI$67:$AR$70,6,FALSE)","v":"Polen"},{"$f":"VLOOKUP($AU67,$AN$67:$AR$70,2,FALSE)","v":0},{"$f":"VLOOKUP($AU67,$AN$67:$AR$70,3,FALSE)","v":0},{"$f":"VLOOKUP($AU67,$AN$67:$AR$70,4,FALSE)","v":0},{"$f":"VLOOKUP($AU67,$AN$67:$AR$70,5,FALSE)","v":0},15,"2014-06-17T13:00:00","Belgien","-","Algeriet",{"$f":"IF(G67='Resultat & tabell'!$G67,2,0)","v":2},"-",{"$f":"IF(I67='Resultat & tabell'!$I67,2,0)","v":2},{"$f":"IF(J67='Resultat & tabell'!$J67,3,0)","v":3},{"$f":"SUM(BE67+BG67+BH67)","v":7}]
[null,15,"2018-06-19","Polen","-","Senegal",null,"-",null,{"$f":"IF(OR(ISBLANK(G68),ISBLANK(I68)),\"\",IF(G68>I68,1,IF(G68<I68,2,\"X\")))","v":""},{"$f":"IF('Resultat & tabell'!J68=\"\",0,BI68)","v":0},2,{"$f":"VLOOKUP(L68,AT67:AY70,2,FALSE)","v":"Senegal"},{"$f":"VLOOKUP(M68,$AU$67:$AY$70,2,FALSE)","v":0},{"$f":"VLOOKUP(M68,$AU$67:$AY$70,3,FALSE)","v":0},{"$f":"VLOOKUP(M68,$AU$67:$AY$70,4,FALSE)","v":0},{"$f":"VLOOKUP(M68,$AU$67:$AY$70,5,FALSE)","v":0},null,null,null,null,null,null,null,null,{"$f":"D68","v":"Polen"},0,0,0,{"$f":"F68","v":"Senegal"},0,0,0,null,{"$f":"RANK($AJ68,$AJ$67:$AJ$71,1)+COUNTIF($AJ$67:$AJ68,$AJ68)-1","v":2},{"$f":"AK68+AL68+AM68","v":1},{"$f":"SUMPRODUCT(($AO$67:$AO$70=AO68)*($AR$67:$AR$70=AR68)*($AP$67:$AP$70>AP68))","v":0},{"$f":"SUMPRODUCT(($AO$67:$AO$70=AO68)*($AR$67:$AR$70>AR68))","v":0},{"$f":"RANK(AO68,$AO$67:$AO$70)","v":1},"Senegal",{"$f":"SUMIF($Z$67:$Z$72,$AN68,$AA$67:$AA$72)+SUMIF($AD$67:$AD$72,$AN68,$AE$67:$AE$72)","v":0},{"$f":"SUMIF($Z$67:$Z$72,$AN68,$AB$67:$AB$72)+SUMIF($AD$67:$AD$72,$AN68,$AF$67:$AF$72)","v":0},{"$f":"SUMIF($Z$67:$Z$72,$AN68,$AC$67:$AC$72)+SUMIF($AD$67:$AD$72,$AN68,$AG$67:$AG$72)","v":0},{"$f":"AP68-AQ68","v":0},null,2,{"$f":"VLOOKUP($AT68,$AI$67:$AR$70,6,FALSE)","v":"Senegal"},{"$f":"VLOOKUP($AU68,$AN$67:$AR$70,2,FALSE)","v":0},{"$f":"VLOOKUP($AU68,$AN$67:$AR$70,3,FALSE)","v":0},{"$f":"VLOOKUP($AU68,$AN$67:$AR$70,4,FALSE)","v":0},{"$f":"VLOOKUP($AU68,$AN$67:$AR$70,5,FALSE)","v":0},16,"2014-06-17T18:00:00","Ryssland","-","Sydkorea",{"$f":"IF(G68='Resultat & tabell'!$G68,2,0)","v":2},"-",{"$f":"IF(I68='Resultat & tabell'!$I68,2,0)","v":2},{"$f":"IF(J68='Resultat & tabell'!$J68,3,0)","v":3},7]
[null,32,"2018-06-24","Japan","-","Senegal",null,"-",null,"",{"$f":"IF('Resultat & tabell'!J69=\"\",0,BI69)","v":0},3,{"$f":"VLOOKUP(L69,AT67:AY70,2,FALSE)","v":"Colombia"},{"$f":"VLOOKUP(M69,$AU$67:$AY$70,2,FALSE)","v":0},{"$f":"VLOOKUP(M69,$AU$67:$AY$70,3,FALSE)","v":0},{"$f":"VLOOKUP(M69,$AU$67:$AY$70,4,FALSE)","v":0},{"$f":"VLOOKUP(M69,$AU$67:$AY$70,5,FALSE)","v":0},null,null,null,null,null,null,null,null,"Japan",0,0,0,"Senegal",0,0,0,null,{"$f":"RANK($AJ69,$AJ$67:$AJ$71,1)+COUNTIF($AJ$67:$AJ69,$AJ69)-1","v":3},{"$f":"AK69+AL69+AM69","v":1},0,0,1,"Colombia",0,0,0,0,null,3,"Colombia",0,0,0,0,31,"2014-06-22T13:00:00","Belgien","-","Ryssland",{"$f":"IF(G69='Resultat & tabell'!$G69,2,0)","v":2},"-",{"$f":"IF(I69='Resultat & tabell'!$I69,2,0)","v":2},{"$f":"IF(J69='Resultat & tabell'!$J69,3,0)","v":3},7]
[null,31,"2018-06-24","Polen","-","Colombia",null,"-",null,"",{"$f":"IF('Resultat & tabell'!J70=\"\",0,BI70)","v":0},4,{"$f":"VLOOKUP(L70,AT67:AY70,2,FALSE)","v":"Japan"},{"$f":"VLOOKUP(M70,$AU$67:$AY$70,2,FALSE)","v":0},{"$f":"VLOOKUP(M70,$AU$67:$AY$70,3,FALSE)","v":0},{"$f":"VLOOKUP(M70,$AU$67:$AY$70,4,FALSE)","v":0},{"$f":"VLOOKUP(M70,$AU$67:$AY$70,5,FALSE)","v":0},null,null,null,null,null,null,null,null,"Polen",0,0,0,"Colombia",0,0,0,null,{"$f":"RANK($AJ70,$AJ$67:$AJ$71,1)+COUNTIF($AJ$67:$AJ70,$AJ70)-1","v":4},{"$f":"AK70+AL70+AM70","v":1},0,0,1,"Japan",0,0,0,0,null,4,"Japan",0,0,0,0,32,"2014-06-22T16:00:00","Sydkorea","-","Algeriet",{"$f":"IF(G70='Resultat & tabell'!$G70,2,0)","v":2},"-",{"$f":"IF(I70='Resultat & tabell'!$I70,2,0)","v":2},{"$f":"IF(J70='Resultat & tabell'!$J70,3,0)","v":3},7]
[null,47,"2018-06-28","Japan","-","Polen",null,"-",null,"",{"$f":"IF('Resultat & tabell'!J71=\"\",0,BI71)","v":0},null,null,null,null,null,null,null,null,null,null,null,null,null,null,"Japan",0,0,0,"Polen",0,0,0,null,null,null,null,null,null,null,null,null,null,null,null,null,null,null,null,null,null,47,"2014-06-26T17:00:00","Sydkorea","-","Belgien",{"$f":"IF(G71='Resultat & tabell'!$G71,2,0)","v":2},"-",{"$f":"IF(I71='Resultat & tabell'!$I71,2,0)","v":2},{"$f":"IF(J71='Resultat & tabell'!$J71,3,0)","v":3},7]
[null,48,"2018-06-28","Senegal","-","Colombia",null,"-",null,"",{"$f":"IF('Resultat & tabell'!J72=\"\",0,BI72)","v":0},null,null,null,null,null,null,null,null,null,null,null,null,null,null,"Senegal",0,0,0,"Colombia",0,0,0,null,null,null,null,null,null,null,null,null,null,null,null,null,null,null,null,null,null,48,"2014-06-26T17:00:00","Algeriet","-","Ryssland",{"$f":"IF(G72='Resultat & tabell'!$G72,2,0)","v":2},"-",{"$f":"IF(I72='Resultat & tabell'!$I72,2,0)","v":2},{"$f":"IF(J72='Resultat & tabell'!$J72,3,0)","v":3},7]
[]
[null,"Åttondelsfinaler",null,null,null,null,null,null,null,null,null,null,null,null,null,null,null,null,null,null,null,null,null,null,null,null,null,null,null,null,null,null,null,null,null,null,null,null,null,null,null,null,null,null,null,null,null,null,null,null,null,"Åttondelsfinaler",null,null,null,null,null,null,null,null,null,null,"Åttondelsfinaler"]
[null,"Match","Datum","Match",null,null,"Resultat",null,null,"Tecken","Poäng",null,"Vinnare åttondelsfinal",null,null,"Poäng för lag i åttondelsfinal",null,null,null,null,null,null,null,null,null,null,"Match",null,null,null,null,null,null,null,null,null,null,null,null,null,null,null,null,null,null,null,null,null,null,null,null,"Match","Datum","Match",null,null,"Resultat",null,null,"Tecken","Poäng",null,null,"Mitt tips","Resultat & tabell","Utfall","Utfall likare","Poäng"]
[null,50,"2018-06-30",{"$f":"M22","v":"Frankrike"},"-",{"$f":"M32","v":"Island"},null,"-",null,{"$f":"IF(OR(ISBLANK(G76),ISBLANK(I76)),\"\",IF(G76>I76,1,IF(G76<I76,2,\"X\")))","v":""},{"$f":"IF('Resultat & tabell'!J76=\"\",0,BI76)","v":0},null,null,{"$f":"IF(OR(ISBLANK(D76),ISBLANK(F76),J76=\"\",M76=\"\"),\"\",IF(OR(AND(J76=1,M76=D76),AND(J76=2,M76=F76),AND(J76=\"X\",OR(M76=D76,M76=F76))),\"\",\"Ej OK\"))","v":""},{"$f":"M76=D76","v":false},{"$f":"BP92","v":0},null,null,null,null,null,null,null,null,null,null,"Vinnare grupp A",null,null,null,"Tvåa grupp B",null,null,null,null,null,null,null,null,null,null,null,null,null,null,null,null,null,null,null,null,49,"2014-06-28",{"$f":"D76","v":"Frankrike"},"-",{"$f":"F76","v":"Island"},{"$f":"IF(G76='Resultat & tabell'!$G76,2,0)","v":2},"-",{"$f":"IF(I76='Resultat & tabell'!$I76,2,0)","v":2},{"$f":"IF(J76='Resultat & tabell'!$J76,3,0)","v":3},{"$f":"SUM(BE76+BG76+BH76)","v":7},null,null,{"$f":"BB76","v":"Frankrike"},{"$f":"'Resultat & tabell'!D76","v":"Frankrike"},{"$f":"VLOOKUP(BL76,$BM$76:$BM$91,1,FALSE)","v":"Frankrike"},{"$f":"BN76","v":"Frankrike"},{"$f":"IFERROR(IF(BN76=BO76,2,0),0)","v":2}]
[null,49,"2018-06-30",{"$f":"M4","v":"Saudiarabien"},"-",{"$f":"M14","v":"Spanien"},null,"-",null,"",{"$f":"IF('Resultat & tabell'!J77=\"\",0,BI77)","v":0},null,null,{"$f":"IF(OR(ISBLANK(D77),ISBLANK(F77),J77=\"\",M77=\"\"),\"\",IF(OR(AND(J77=1,M77=D77),AND(J77=2,M77=F77),AND(J77=\"X\",OR(M77=D77,M77=F77))),\"\",\"Ej OK\"))","v":""},null,null,null,null,null,null,null,null,null,null,null,null,"Vinnare grupp C",null,null,null,"Tvåa grupp D",null,null,null,null,null,null,null,null,null,null,null,null,null,null,null,null,null,null,null,null,50,"2014-06-28T17:00:00","Saudiarabien","-","Spanien",{"$f":"IF(G77='Resultat & tabell'!$G77,2,0)","v":2},"-",{"$f":"IF(I77='Resultat & tabell'!$I77,2,0)","v":2},{"$f":"IF(J77='Resultat & tabell'!$J77,3,0)","v":3},7,null,null,"Saudiarabien",{"$f":"'Resultat & tabell'!D77","v":"Ryssland"},"Saudiarabien",{"$f":"BN77","v":"Saudiarabien"},2]
[null,51,"2018-07-01",{"$f":"M13","v":"Portugal"},"-",{"$f":"M5","v":"Ryssland"},null,"-",null,"",{"$f":"IF('Resultat & tabell'!J78=\"\",0,BI78)","v":0},null,null,"",null,null,null,null,null,null,null,null,null,null,null,null,"Vinnare grupp B",null,null,null,"Tvåa grupp A",null,null,null,null,null,null,null,null,null,null,null,null,null,null,null,null,null,null,null,null,51,"2014-06-29T13:00:00","Portugal","-","Ryssland",{"$f":"IF(G78='Resultat & tabell'!$G78,2,0)","v":2},"-",{"$f":"IF(I78='Resultat & tabell'!$I78,2,0)","v":2},{"$f":"IF(J78='Resultat & tabell'!$J78,3,0)","v":3},7,null,null,"Portugal",{"$f":"'Resultat & tabell'!D78","v":"Portugal"},"Portugal","Portugal",2]
[null,52,"2018-07-01",{"$f":"M31","v":"Argentina"},"-",{"$f":"M23","v":"Australien"},null,"-",null,"",{"$f":"IF('Resultat & tabell'!J79=\"\",0,BI79)","v":0},null,null,"",null,null,null,null,null,null,null,null,null,null,null,null,"Vinnare grupp D",null,null,null,"Tvåa grupp C",null,null,null,null,null,null,null,null,null,null,null,null,null,null,null,null,null,null,null,null,52,"2014-06-29T17:00:00","Argentina","-","Australien",{"$f":"IF(G79='Resultat & tabell'!$G79,2,0)","v":2},"-",{"$f":"IF(I79='Resultat & tabell'!$I79,2,0)","v":2},{"$f":"IF(J79='Resultat & tabell'!$J79,3,0)","v":3},7,null,null,"Argentina",{"$f":"'Resultat & tabell'!D79","v":"Argentina"},"Argentina","Argentina",2]
[null,53,"2018-07-02",{"$f":"M40","v":"Brasilien"},"-",{"$f":"M50","v":"Mexico"},null,"-",null,"",{"$f":"IF('Resultat & tabell'!J80=\"\",0,BI80)","v":0},null,null,"",null,null,null,null,null,null,null,null,null,null,null,null,"Vinnare grupp E",null,null,null,"Tvåa grupp F",null,null,null,null,null,null,null,null,null,null,null,null,null,null,null,null,null,null,null,null,53,"2014-06-30T13:00:00","Brasilien","-","Mexico",{"$f":"IF(G80='Resultat & tabell'!$G80,2,0)","v":2},"-",{"$f":"IF(I80='Resultat & tabell'!$I80,2,0)","v":2},{"$f":"IF(J80='Resultat & tabell'!$J80,3,0)","v":3},7,null,null,"Brasilien",{"$f":"'Resultat & tabell'!D80","v":"Brasilien"},"Brasilien","Brasilien",2]
[null,54,"2018-07-02",{"$f":"M58","v":"Belgien"},"-",{"$f":"M68","v":"Senegal"},null,"-",null,"",{"$f":"IF('Resultat & tabell'!J81=\"\",0,BI81)","v":0},null,null,"",null,null,null,null,null,null,null,null,null,null,null,null,"Vinnare grupp G",null,null,null,"Tvåa grupp H",null,null,null,null,null,null,null,null,null,null,null,null,null,null,null,null,null,null,null,null,54,"2014-06-30T17:00:00","Belgien","-","Senegal",{"$f":"IF(G81='Resultat & tabell'!$G81,2,0)","v":2},"-",{"$f":"IF(I81='Resultat & tabell'!$I81,2,0)","v":2},{"$f":"IF(J81='Resultat & tabell'!$J81,3,0)","v":3},7,null,null,"Belgien",{"$f":"'Resultat & tabell'!D81","v":"Belgien"},"Belgien","Belgien",2]
[null,55,"2018-07-03",{"$f":"M49","v":"Tyskland"},"-",{"$f":"M41","v":"Schweiz"},null,"-",null,"",{"$f":"IF('Resultat & tabell'!J82=\"\",0,BI82)","v":0},null,null,"",null,null,null,null,null,null,null,null,null,null,null,null,"Vinnare grupp F",null,null,null,"Tvåa grupp E",null,null,null,null,null,null,null,null,null,null,null,null,null,null,null,null,null,null,null,null,55,"2014-07-01","Tyskland","-","Schweiz",{"$f":"IF(G82='Resultat & tabell'!$G82,2,0)","v":2},"-",{"$f":"IF(I82='Resultat & tabell'!$I82,2,0)","v":2},{"$f":"IF(J82='Resultat & tabell'!$J82,3,0)","v":3},7,null,null,"Tyskland",{"$f":"'Resultat & tabell'!D82","v":"Tyskland"},"Tyskland","Tyskland",2]
[null,56,"2018-07-03",{"$f":"M67","v":"Polen"},"-",{"$f":"M59","v":"Panama"},null,"-",null,"",{"$f":"IF('Resultat & tabell'!J83=\"\",0,BI83)","v":0},null,null,"",null,null,null,null,null,null,null,null,null,null,null,null,"Vinnare grupp H",null,null,null,"Tvåa grupp G",null,null,null,null,null,null,null,null,null,null,null,null,null,null,null,null,null,null,null,null,56,"2014-07-01","Polen","-","Panama",{"$f":"IF(G83='Resultat & tabell'!$G83,2,0)","v":2},"-",{"$f":"IF(I83='Resultat & tabell'!$I83,2,0)","v":2},{"$f":"IF(J83='Resultat & tabell'!$J83,3,0)","v":3},7,null,null,"Polen",{"$f":"'Resultat & tabell'!D83","v":"Polen"},"Polen","Polen",2]
[null,null,null,null,null,null,null,null,null,null,null,null,null,null,null,null,null,null,null,null,null,null,null,null,null,null,null,null,null,null,null,null,null,null,null,null,null,null,null,null,null,null,null,null,null,null,null,null,null,null,null,null,null,null,null,null,null,null,null,null,null,null,null,{"$f":"BD76","v":"Island"},{"$f":"'Resultat & tabell'!F76","v":"Island"},"Island","Island",2]
[null,"Kvartsfinaler",null,null,null,null,null,null,null,null,null,null,null,null,null,null,null,null,null,null,null,null,null,null,null,null,null,null,null,null,null,null,null,null,null,null,null,null,null,null,null,null,null,null,null,null,null,null,null,null,null,"Kvartsfinaler",null,null,null,null,null,null,null,null,null,null,null,"Spanien",{"$f":"'Resultat & tabell'!F77","v":"Spanien"},"Spanien","Spanien",2]
[null,"Match","Datum","Match",null,null,"Resultat",null,null,"Tecken","Poäng",null,"Vinnare kvartsfinal",null,null,"Poäng för lag i kvartsfinal",null,null,null,null,null,null,null,null,null,null,"Match",null,null,null,null,null,null,null,null,null,null,null,null,null,null,null,null,null,null,null,null,null,null,null,null,"Match","Datum","Match",null,null,"Resultat",null,null,"Tecken","Poäng",null,null,"Ryssland",{"$f":"'Resultat & tabell'!F78","v":"Saudiarabien"},"Ryssland","Ryssland",2]
[null,57,"2018-07-06",{"$f":"IF(M77=\"\",\"Vinnare match 49\",M77)","v":"Vinnare match 49"},"-",{"$f":"IF(M76=\"\",\"Vinnare match 50\",M76)","v":"Vinnare match 50"},null,"-",null,{"$f":"IF(OR(ISBLANK(G87),ISBLANK(I87)),\"\",IF(G87>I87,1,IF(G87<I87,2,\"X\")))","v":""},{"$f":"IF('Resultat & tabell'!J87=\"\",0,BI87)","v":0},null,null,{"$f":"IF(OR(ISBLANK(D87),ISBLANK(F87),J87=\"\",M87=\"\"),\"\",IF(OR(AND(J87=1,M87=D87),AND(J87=2,M87=F87),AND(J87=\"X\",OR(M87=D87,M87=F87))),\"\",\"Ej OK\"))","v":""},null,{"$f":"BP103","v":0},null,null,null,null,null,null,null,null,null,null,"Vinnare match 49",null,null,null,"Vinnare match 50",null,null,null,null,null,null,null,null,null,null,null,null,null,null,null,null,null,null,null,null,57,"2014-07-04",{"$f":"D87","v":"Vinnare match 49"},"-",{"$f":"F87","v":"Vinnare match 50"},{"$f":"IF(G87='Resultat & tabell'!$G87,2,0)","v":2},"-",{"$f":"IF(I87='Resultat & tabell'!$I87,2,0)","v":2},{"$f":"IF(J87='Resultat & tabell'!$J87,3,0)","v":3},{"$f":"SUM(BE87+BG87+BH87)","v":7},null,null,"Australien",{"$f":"'Resultat & tabell'!F79","v":"Australien"},"Australien","Australien",2]
[null,58,"2018-07-06",{"$f":"IF(M80=\"\",\"Vinnare match 53\",M80)","v":"Vinnare match 53"},"-",{"$f":"IF(M81=\"\",\"Vinnare match 54\",M81)","v":"Vinnare match 54"},null,"-",null,"",{"$f":"IF('Resultat & tabell'!J88=\"\",0,BI88)","v":0},null,null,{"$f":"IF(OR(ISBLANK(D88),ISBLANK(F88),J88=\"\",M88=\"\"),\"\",IF(OR(AND(J88=1,M88=D88),AND(J88=2,M88=F88),AND(J88=\"X\",OR(M88=D88,M88=F88))),\"\",\"Ej OK\"))","v":""},null,null,null,null,null,null,null,null,null,null,null,null,"Vinnare match 53",null,null,null,"Vinnare match 54",null,null,null,null,null,null,null,null,null,null,null,null,null,null,null,null,null,null,null,null,58,"2014-07-04",{"$f":"D88","v":"Vinnare match 53"},"-",{"$f":"F88","v":"Vinnare match 54"},{"$f":"IF(G88='Resultat & tabell'!$G88,2,0)","v":2},"-",{"$f":"IF(I88='Resultat & tabell'!$I88,2,0)","v":2},{"$f":"IF(J88='Resultat & tabell'!$J88,3,0)","v":3},7,null,null,"Mexico",{"$f":"'Resultat & tabell'!F80","v":"Mexico"},"Mexico","Mexico",2]
[null,59,"2018-07-07",{"$f":"IF(M78=\"\",\"Vinnare match 51\",M78)","v":"Vinnare match 51"},"-",{"$f":"IF(M79=\"\",\"Vinnare match 52\",M79)","v":"Vinnare match 52"},null,"-",null,"",{"$f":"IF('Resultat & tabell'!J89=\"\",0,BI89)","v":0},null,null,"",null,null,null,null,null,null,null,null,null,null,null,null,"Vinnare match 51",null,null,null,"Vinnare match 52",null,null,null,null,null,null,null,null,null,null,null,null,null,null,null,null,null,null,null,null,59,"2014-07-05",{"$f":"D89","v":"Vinnare match 51"},"-",{"$f":"F89","v":"Vinnare match 52"},{"$f":"IF(G89='Resultat & tabell'!$G89,2,0)","v":2},"-",{"$f":"IF(I89='Resultat & tabell'!$I89,2,0)","v":2},{"$f":"IF(J89='Resultat & tabell'!$J89,3,0)","v":3},7,null,null,"Senegal",{"$f":"'Resultat & tabell'!F81","v":"Senegal"},"Senegal","Senegal",2]
[null,60,"2018-07-07",{"$f":"IF(M82=\"\",\"Vinnare match 55\",M82)","v":"Vinnare match 55"},"-",{"$f":"IF(M83=\"\",\"Vinnare match 56\",M83)","v":"Vinnare match 56"},null,"-",null,"",{"$f":"IF('Resultat & tabell'!J90=\"\",0,BI90)","v":0},null,null,"",null,null,null,null,null,null,null,null,null,null,null,null,"Vinnare match 55",null,null,null,"Vinnare match 56",null,null,null,null,null,null,null,null,null,null,null,null,null,null,null,null,null,null,null,null,60,"2014-07-05",{"$f":"D90","v":"Vinnare match 55"},"-",{"$f":"F90","v":"Vinnare match 56"},{"$f":"IF(G90='Resultat & tabell'!$G90,2,0)","v":2},"-",{"$f":"IF(I90='Resultat & tabell'!$I90,2,0)","v":2},{"$f":"IF(J90='Resultat & tabell'!$J90,3,0)","v":3},7,null,null,"Schweiz",{"$f":"'Resultat & tabell'!F82","v":"Schweiz"},"Schweiz","Schweiz",2]
[null,null,null,null,null,null,null,null,null,null,null,null,null,null,null,null,null,null,null,null,null,null,null,null,null,null,null,null,null,null,null,null,null,null,null,null,null,null,null,null,null,null,null,null,null,null,null,null,null,null,null,null,null,null,null,null,null,null,null,null,null,null,null,"Panama",{"$f":"'Resultat & tabell'!F83","v":"Panama"},"Panama","Panama",2]
[null,"Semifinaler",null,null,null,null,null,null,null,null,null,null,null,null,null,null,null,null,null,null,null,null,null,null,null,null,null,null,null,null,null,null,null,null,null,null,null,null,null,null,null,null,null,null,null,null,null,null,null,null,null,"Semifinaler",null,null,null,null,null,null,null,null,null,null,null,null,null,null,"SUMMA",{"$f":"IF(COUNTIFS('Resultat & tabell'!J3:J72,\"\")=14,SUM(BP76:BP91),0)","v":0}]
[null,"Match","Datum","Match",null,null,"Resultat",null,null,"Tecken","Poäng",null,"Vinnare semifinal",null,"Förlorare","Poäng för lag i semifinal",null,null,null,null,null,null,null,null,null,null,"Match",null,null,null,null,null,null,null,null,null,null,null,null,null,null,null,null,null,null,null,null,null,null,null,null,"Match","Datum","Match",null,null,"Resultat",null,null,"Tecken","Poäng",null,null,"Kvartsfinaler"]
[null,61,"2018-07-10",{"$f":"IF(M87=\"\",\"Vinnare match 57\",M87)","v":"Vinnare match 57"},"-",{"$f":"IF(M88=\"\",\"Vinnare match 58\",M88)","v":"Vinnare match 58"},null,"-",null,{"$f":"IF(OR(ISBLANK(G94),ISBLANK(I94)),\"\",IF(G94>I94,1,IF(G94<I94,2,\"X\")))","v":""},{"$f":"IF('Resultat & tabell'!J94=\"\",0,BI94)","v":0},null,null,{"$f":"IF(OR(ISBLANK(D94),ISBLANK(F94),J94=\"\",M94=\"\"),\"\",IF(OR(AND(J94=1,M94=D94),AND(J94=2,M94=F94),AND(J94=\"X\",OR(M94=D94,M94=F94))),\"\",\"Ej OK\"))","v":""},null,{"$f":"BP110","v":0},null,null,null,{"$f":"IF(M94=D94,F94,D94)","v":"Vinnare match 57"},null,null,null,null,null,null,"Vinnare match 57",null,null,null,"Vinnare match 58",null,null,null,null,null,null,null,null,null,null,null,null,null,null,null,null,null,null,null,null,61,"2014-07-08T17:00:00",{"$f":"D94","v":"Vinnare match 57"},"-",{"$f":"F94","v":"Vinnare match 58"},{"$f":"IF(G94='Resultat & tabell'!$G94,2,0)","v":2},"-",{"$f":"IF(I94='Resultat & tabell'!$I94,2,0)","v":2},{"$f":"IF(J94='Resultat & tabell'!$J94,3,0)","v":3},{"$f":"SUM(BE94+BG94+BH94)","v":7},null,null,"Mitt tips","Resultat & tabell","Utfall","Utfall likare","Poäng"]
[null,62,"2018-07-11",{"$f":"IF(M89=\"\",\"Vinnare match 59\",M89)","v":"Vinnare match 59"},"-",{"$f":"IF(M90=\"\",\"Vinnare match 60\",M90)","v":"Vinnare match 60"},null,"-",null,"",{"$f":"IF('Resultat & tabell'!J95=\"\",0,BI95)","v":0},null,null,{"$f":"IF(OR(ISBLANK(D95),ISBLANK(F95),J95=\"\",M95=\"\"),\"\",IF(OR(AND(J95=1,M95=D95),AND(J95=2,M95=F95),AND(J95=\"X\",OR(M95=D95,M95=F95))),\"\",\"Ej OK\"))","v":""},null,null,null,null,null,{"$f":"IF(M95=D95,F95,D95)","v":"Vinnare match 59"},null,null,null,null,null,null,"Vinnare match 59",null,null,null,"Vinnare match 60",null,null,null,null,null,null,null,null,null,null,null,null,null,null,null,null,null,null,null,null,62,"2014-07-09T17:00:00",{"$f":"D95","v":"Vinnare match 59"},"-",{"$f":"F95","v":"Vinnare match 60"},{"$f":"IF(G95='Resultat & tabell'!$G95,2,0)","v":2},"-",{"$f":"IF(I95='Resultat & tabell'!$I95,2,0)","v":2},{"$f":"IF(J95='Resultat & tabell'!$J95,3,0)","v":3},7,null,null,{"$f":"D87","v":"Vinnare match 49"},{"$f":"'Resultat & tabell'!D87","v":"Vinnare match 49"},{"$f":"VLOOKUP(BL95,$BM$95:$BM$102,1,FALSE)","v":"Vinnare match 49"},{"$f":"BN95","v":"Vinnare match 49"},{"$f":"IFERROR(IF(AND(COUNTIF($J$76:$J$83,\"\")=0,BN95=BO95),4,0),0)","v":0}]
[null,null,null,null,null,null,null,null,null,null,null,null,null,null,null,null,null,null,null,null,null,null,null,null,null,null,null,null,null,null,null,null,null,null,null,null,null,null,null,null,null,null,null,null,null,null,null,null,null,null,null,null,null,null,null,null,null,null,null,null,null,null,null,{"$f":"D88","v":"Vinnare match 53"},{"$f":"'Resultat & tabell'!D88","v":"Vinnare match 53"},"Vinnare match 53","Vinnare match 53",{"$f":"IFERROR(IF(AND(COUNTIF($J$76:$J$83,\"\")=0,BN96=BO96),4,0),0)","v":0}]
[null,"Bronsmatch",null,null,null,null,null,null,null,null,null,null,null,null,null,null,null,null,null,null,null,null,null,null,null,null,null,null,null,null,null,null,null,null,null,null,null,null,null,null,null,null,null,null,null,null,null,null,null,null,null,"Bronsmatch",null,null,null,null,null,null,null,null,null,null,null,{"$f":"D89","v":"Vinnare match 51"},{"$f":"'Resultat & tabell'!D89","v":"Vinnare match 51"},"Vinnare match 51","Vinnare match 51",0]
[null,"Match","Datum","Match",null,null,"Resultat",null,null,"Tecken","Poäng",null,"Vinnare bronsmatch",null,null,"Poäng för lag i bronsmatch",null,null,null,null,null,null,null,null,null,null,"Match",null,null,null,null,null,null,null,null,null,null,null,null,null,null,null,null,null,null,null,null,null,null,null,null,"Match","Datum","Match",null,null,"Resultat",null,null,"Tecken","Poäng",null,null,{"$f":"D90","v":"Vinnare match 55"},{"$f":"'Resultat & tabell'!D90","v":"Vinnare match 55"},"Vinnare match 55","Vinnare match 55",0]
[null,63,"2018-07-14",{"$f":"IF(M94=\"\",\"Förlorare match 61\",T94)","v":"Förlorare match 61"},"-",{"$f":"IF(M95=\"\",\"Förlorare match 62\",T95)","v":"Förlorare match 62"},null,"-",null,{"$f":"IF(OR(ISBLANK(G99),ISBLANK(I99)),\"\",IF(G99>I99,1,IF(G99<I99,2,\"X\")))","v":""},{"$f":"IF('Resultat & tabell'!J99=\"\",0,BI99)","v":0},null,null,{"$f":"IF(OR(ISBLANK(D99),ISBLANK(F99),J99=\"\",M99=\"\"),\"\",IF(OR(AND(J99=1,M99=D99),AND(J99=2,M99=F99),AND(J99=\"X\",OR(M99=D99,M99=F99))),\"\",\"Ej OK\"))","v":""},null,{"$f":"BP115","v":0},null,null,null,null,null,null,null,null,null,null,"Förlorare match 61",null,null,null,"Förlorare match 62",null,null,null,null,null,null,null,null,null,null,null,null,null,null,null,null,null,null,null,null,63,"2014-07-12",{"$f":"D99","v":"Förlorare match 61"},"-",{"$f":"F99","v":"Förlorare match 62"},{"$f":"IF(G99='Resultat & tabell'!$G99,2,0)","v":2},"-",{"$f":"IF(I99='Resultat & tabell'!$I99,2,0)","v":2},{"$f":"IF(J99='Resultat & tabell'!$J99,3,0)","v":3},{"$f":"SUM(BE99+BG99+BH99)","v":7},null,null,{"$f":"F87","v":"Vinnare match 50"},{"$f":"'Resultat & tabell'!F87","v":"Vinnare match 50"},"Vinnare match 50","Vinnare match 50",0]
[null,null,null,null,null,null,null,null,null,null,null,null,null,null,null,null,null,null,null,null,null,null,null,null,null,null,null,null,null,null,null,null,null,null,null,null,null,null,null,null,null,null,null,null,null,null,null,null,null,null,null,null,null,null,null,null,null,null,null,null,null,null,null,{"$f":"F88","v":"Vinnare match 54"},{"$f":"'Resultat & tabell'!F88","v":"Vinnare match 54"},"Vinnare match 54","Vinnare match 54",0]
[null,"Final",null,null,null,null,null,null,null,null,null,null,null,null,null,null,null,null,null,null,null,null,null,null,null,null,null,null,null,null,null,null,null,null,null,null,null,null,null,null,null,null,null,null,null,null,null,null,null,null,null,"Final",null,null,null,null,null,null,null,null,null,null,null,{"$f":"F89","v":"Vinnare match 52"},{"$f":"'Resultat & tabell'!F89","v":"Vinnare match 52"},"Vinnare match 52","Vinnare match 52",0]
[null,"Match","Datum","Match",null,null,"Resultat",null,null,"Tecken","Poäng",null,"Vinnare final",null,null,"Poäng för lag i final",null,null,null,null,null,null,null,null,null,null,"Match",null,null,null,null,null,null,null,null,null,null,null,null,null,null,null,null,null,null,null,null,null,null,null,null,"Match","Datum","Match",null,null,"Resultat",null,null,"Tecken","Poäng",null,null,{"$f":"F90","v":"Vinnare match 56"},{"$f":"'Resultat & tabell'!F90","v":"Vinnare match 56"},"Vinnare match 56","Vinnare match 56",0]
[null,64,"2018-07-15",{"$f":"IF(M94=\"\",\"Vinnare match 61\",M94)","v":"Vinnare match 61"},"-",{"$f":"IF(M95=\"\",\"Vinnare match 62\",M95)","v":"Vinnare match 62"},null,"-",null,{"$f":"IF(OR(ISBLANK(G103),ISBLANK(I103)),\"\",IF(G103>I103,1,IF(G103<I103,2,\"X\")))","v":""},{"$f":"IF('Resultat & tabell'!J103=\"\",0,BI103)","v":0},null,null,{"$f":"IF(OR(ISBLANK(D103),ISBLANK(F103),J103=\"\",M103=\"\"),\"\",IF(OR(AND(J103=1,M103=D103),AND(J103=2,M103=F103),AND(J103=\"X\",OR(M103=D103,M103=F103))),\"\",\"Ej OK\"))","v":""},null,{"$f":"BP120","v":0},null,null,null,null,null,null,null,null,null,null,"Vinnare match 61",null,null,null,"Vinnare match 62",null,null,null,null,null,null,null,null,null,null,null,null,null,null,null,null,null,null,null,null,64,"2014-07-13T16:00:00",{"$f":"D103","v":"Vinnare match 61"},"-",{"$f":"F103","v":"Vinnare match 62"},{"$f":"IF(G103='Resultat & tabell'!$G103,2,0)","v":2},"-",{"$f":"IF(I103='Resultat & tabell'!$I103,2,0)","v":2},{"$f":"IF(J103='Resultat & tabell'!$J103,3,0)","v":3},{"$f":"SUM(BE103+BG103+BH103)","v":7},null,null,null,null,null,"SUMMA",{"$f":"SUM(BP95:BP102)","v":0}]
[null,null,null,null,null,null,null,null,null,null,null,null,null,null,null,null,null,null,null,null,null,null,null,null,null,null,null,null,null,null,null,null,null,null,null,null,null,null,null,null,null,null,null,null,null,null,null,null,null,null,null,null,null,null,null,null,null,null,null,null,null,null,null,"Semifinaler"]
[null,null,null,null,null,null,null,null,null,null,null,null,null,null,null,null,null,null,null,null,null,null,null,null,null,null,null,null,null,null,null,null,null,null,null,null,null,null,null,null,null,null,null,null,null,null,null,null,null,null,null,null,null,null,null,null,null,null,null,null,null,null,null,"Mitt tips","Resultat & tabell","Utfall","Utfall likare","Poäng"]
[null,null,null,null,null,null,null,null,null,null,null,null,null,null,null,null,null,null,null,null,null,null,null,null,null,null,null,null,null,null,null,null,null,null,null,null,null,null,null,null,null,null,null,null,null,null,null,null,null,null,null,null,null,null,null,null,null,null,null,null,null,null,null,{"$f":"D94","v":"Vinnare match 57"},{"$f":"'Resultat & tabell'!D94","v":"Vinnare match 57"},{"$f":"VLOOKUP(BL106,$BM$106:$BM$109,1,FALSE)","v":"Vinnare match 57"},{"$f":"BN106","v":"Vinnare match 57"},{"$f":"IFERROR(IF(AND(COUNTIF($J$87:$J$90,\"\")=0,BN106=BO106),6,0),0)","v":0}]
[null,null,null,null,null,null,null,null,null,null,null,null,null,null,null,null,null,null,null,null,null,null,null,null,null,null,null,null,null,null,null,null,null,null,null,null,null,null,null,null,null,null,null,null,null,null,null,null,null,null,null,null,null,null,null,null,null,null,null,null,null,null,null,{"$f":"D95","v":"Vinnare match 59"},{"$f":"'Resultat & tabell'!D95","v":"Vinnare match 59"},{"$f":"VLOOKUP(BL107,$BM$106:$BM$109,1,FALSE)","v":"Vinnare match 59"},"Vinnare match 59",{"$f":"IFERROR(IF(AND(COUNTIF($J$87:$J$90,\"\")=0,BN107=BO107),6,0),0)","v":0}]
[null,null,null,null,null,null,null,null,null,null,null,null,null,null,null,null,null,null,null,null,null,null,null,null,null,null,null,null,null,null,null,null,null,null,null,null,null,null,null,null,null,null,null,null,null,null,null,null,null,null,null,null,null,null,null,null,null,null,null,null,null,null,null,{"$f":"F94","v":"Vinnare match 58"},{"$f":"'Resultat & tabell'!F94","v":"Vinnare match 58"},{"$f":"VLOOKUP(BL108,$BM$106:$BM$109,1,FALSE)","v":"Vinnare match 58"},"Vinnare match 58",0]
[null,null,null,null,null,null,null,null,null,null,null,null,null,null,null,null,null,null,null,null,null,null,null,null,null,null,null,null,null,null,null,null,null,null,null,null,null,null,null,null,null,null,null,null,null,null,null,null,null,null,null,null,null,null,null,null,null,null,null,null,null,null,null,{"$f":"F95","v":"Vinnare match 60"},{"$f":"'Resultat & tabell'!F95","v":"Vinnare match 60"},{"$f":"VLOOKUP(BL109,$BM$106:$BM$109,1,FALSE)","v":"Vinnare match 60"},"Vinnare match 60",0]
[null,null,null,null,null,null,null,null,null,null,null,null,null,null,null,null,null,null,null,null,null,null,null,null,null,null,null,null,null,null,null,null,null,null,null,null,null,null,null,null,null,null,null,null,null,null,null,null,null,null,null,null,null,null,null,null,null,null,null,null,null,null,null,null,null,null,"SUMMA",{"$f":"SUM(BP106:BP109)","v":0}]
[null,null,null,null,null,null,null,null,null,null,null,null,null,null,null,null,null,null,null,null,null,null,null,null,null,null,null,null,null,null,null,null,null,null,null,null,null,null,null,null,null,null,null,null,null,null,null,null,null,null,null,null,null,null,null,null,null,null,null,null,null,null,null,"Bronsmatch"]
[null,null,null,null,null,null,null,null,null,null,null,null,null,null,null,null,null,null,null,null,null,null,null,null,null,null,null,null,null,null,null,null,null,null,null,null,null,null,null,null,null,null,null,null,null,null,null,null,null,null,null,null,null,null,null,null,null,null,null,null,null,null,null,"Mitt tips","Resultat & tabell","Utfall","Utfall likare","Poäng"]
[null,null,null,null,null,null,null,null,null,null,null,null,null,null,null,null,null,null,null,null,null,null,null,null,null,null,null,null,null,null,null,null,null,null,null,null,null,null,null,null,null,null,null,null,null,null,null,null,null,null,null,null,null,null,null,null,null,null,null,null,null,null,null,{"$f":"D99","v":"Förlorare match 61"},{"$f":"'Resultat & tabell'!D99","v":"Förlorare match 61"},{"$f":"VLOOKUP(BL113,$BM$113:$BM$114,1,FALSE)","v":"Förlorare match 61"},{"$f":"BN113","v":"Förlorare match 61"},{"$f":"IFERROR(IF(AND(COUNTIF($J$94:$J$95,\"\")=0,BN113=BO113),8,0),0)","v":0}]
[null,null,null,null,null,null,null,null,null,null,null,null,null,null,null,null,null,null,null,null,null,null,null,null,null,null,null,null,null,null,null,null,null,null,null,null,null,null,null,null,null,null,null,null,null,null,null,null,null,null,null,null,null,null,null,null,null,null,null,null,null,null,null,{"$f":"F99","v":"Förlorare match 62"},{"$f":"'Resultat & tabell'!F99","v":"Förlorare match 62"},{"$f":"VLOOKUP(BL114,$BM$113:$BM$114,1,FALSE)","v":"Förlorare match 62"},"Förlorare match 62",{"$f":"IFERROR(IF(AND(COUNTIF($J$94:$J$95,\"\")=0,BN114=BO114),8,0),0)","v":0}]
[null,null,null,null,null,null,null,null,null,null,null,null,null,null,null,null,null,null,null,null,null,null,null,null,null,null,null,null,null,null,null,null,null,null,null,null,null,null,null,null,null,null,null,null,null,null,null,null,null,null,null,null,null,null,null,null,null,null,null,null,null,null,null,null,null,null,"SUMMA",{"$f":"SUM(BP113:BP114)","v":0}]
[null,null,null,null,null,null,null,null,null,null,null,null,null,null,null,null,null,null,null,null,null,null,null,null,null,null,null,null,null,null,null,null,null,null,null,null,null,null,null,null,null,null,null,null,null,null,null,null,null,null,null,null,null,null,null,null,null,null,null,null,null,null,null,"Final"]
[null,null,null,null,null,null,null,null,null,null,null,null,null,null,null,null,null,null,null,null,null,null,null,null,null,null,null,null,null,null,null,null,null,null,null,null,null,null,null,null,null,null,null,null,null,null,null,null,null,null,null,null,null,null,null,null,null,null,null,null,null,null,null,"Mitt tips","Resultat & tabell","Utfall","Utfall likare","Poäng"]
[null,null,null,null,null,null,null,null,null,null,null,null,null,null,null,null,null,null,null,null,null,null,null,null,null,null,null,null,null,null,null,null,null,null,null,null,null,null,null,null,null,null,null,null,null,null,null,null,null,null,null,null,null,null,null,null,null,null,null,null,null,null,null,{"$f":"D103","v":"Vinnare match 61"},{"$f":"'Resultat & tabell'!D103","v":"Vinnare match 61"},{"$f":"VLOOKUP(BL118,$BM$118:$BM$119,1,FALSE)","v":"Vinnare match 61"},{"$f":"BN118","v":"Vinnare match 61"},{"$f":"IFERROR(IF(AND(COUNTIF($J$94:$J$95,\"\")=0,BN118=BO118),8,0),0)","v":0}]
[null,null,null,null,null,null,null,null,null,null,null,null,null,null,null,null,null,null,null,null,null,null,null,null,null,null,null,null,null,null,null,null,null,null,null,null,null,null,null,null,null,null,null,null,null,null,null,null,null,null,null,null,null,null,null,null,null,null,null,null,null,null,null,{"$f":"F103","v":"Vinnare match 62"},{"$f":"'Resultat & tabell'!F103","v":"Vinnare match 62"},{"$f":"VLOOKUP(BL119,$BM$118:$BM$119,1,FALSE)","v":"Vinnare match 62"},"Vinnare match 62",{"$f":"IFERROR(IF(AND(COUNTIF($J$94:$J$95,\"\")=0,BN119=BO119),8,0),0)","v":0}]
[null,null,null,null,null,null,null,null,null,null,null,null,null,null,null,null,null,null,null,null,null,null,null,null,null,null,null,null,null,null,null,null,null,null,null,null,null,null,null,null,null,null,null,null,null,null,null,null,null,null,null,null,null,null,null,null,null,null,null,null,null,null,null,null,null,null,"SUMMA",{"$f":"SUM(BP118:BP119)","v":0}]